Script start time: Sat Aug 15 19:10:07 MDT 2020

Script end: Sat Aug 15 20:21:35 MDT 2020


_____________________________________ESMF TRUNK BUILD AND TEST SUMMARY___________________________



                                            
                    INSTALL/
           BUILD  QUICK_START OS.COMPILER.COMM.ABI    UNIT TESTS   EXAMPLES  SYSTEM TESTS  APPS TESTS
______________________________________________________________________________________________________
          PASS/FAIL PASS/FAIL                           PASS/FAIL   PASS/FAIL  PASS/FAIL   PASS/FAIL
______________________________________________________________________________________________________
cgdm-catania(g)PASS      PASS    Darwin.gfortranclang.mpiuni.64    0/4674      0/43       0/7      0/18
cgdm-catania(O)PASS      PASS    Darwin.gfortranclang.mpiuni.64    0/7252      0/43       0/7      0/18
cgdm-catania(g)**FAIL**            Darwin.gfortranclang.mpich3.64
cgdm-catania(O)**FAIL**            Darwin.gfortranclang.mpich3.64

_______________________________________________________________________________________________

Sat Aug 15 19:10:50 MDT 2020 on cgdm-catania 

ESMF Checkout Source: https://github.com/esmf-org/esmf.git

Compiler and configuration information:

-------------------------------------------------------------- 
Currently Loaded Modulefiles:
 1) GCC/Homebrew/9.3.0_1/gcc   2) GCC/Homebrew/9.3.0_1/netcdf/4.7.4s  

Repository:
origin	https://github.com/esmf-org/esmf.git (fetch)
origin	https://github.com/esmf-org/esmf.git (push)
 
ESMF_8_1_0_beta_snapshot_25-23-g5724188759
 
 
 
--------------------------------------------------------------
ESMF_VERSION_STRING:    8.1.0 beta snapshot
ESMF_8_1_0_beta_snapshot_25-23-g5724188759
--------------------------------------------------------------
On branch develop
Your branch is up to date with 'origin/develop'.

Untracked files:
  (use "git add ..." to include in what will be committed)

	tmp

nothing added to commit but untracked files present (use "git add" to track)
--------------------------------------------------------------
 
--------------------------------------------------------------
Make version:
GNU Make 3.81
Copyright (C) 2006  Free Software Foundation, Inc.
This is free software; see the source for copying conditions.
There is NO warranty; not even for MERCHANTABILITY or FITNESS FOR A
PARTICULAR PURPOSE.

This program built for i386-apple-darwin11.3.0

--------------------------------------------------------------
Fortran Compiler version:
GNU Fortran (Homebrew GCC 10.1.0) 10.1.0
Copyright (C) 2020 Free Software Foundation, Inc.
This is free software; see the source for copying conditions.  There is NO
warranty; not even for MERCHANTABILITY or FITNESS FOR A PARTICULAR PURPOSE.


--------------------------------------------------------------
C++ Compiler version:
Apple LLVM version 10.0.1 (clang-1001.0.46.4)
Target: x86_64-apple-darwin18.7.0
Thread model: posix
InstalledDir: /Library/Developer/CommandLineTools/usr/bin

--------------------------------------------------------------
Preprocessor version:
Apple LLVM version 10.0.1 (clang-1001.0.46.4)
Target: x86_64-apple-darwin18.7.0
Thread model: posix
InstalledDir: /Library/Developer/CommandLineTools/usr/bin
--------------------------------------------------------------
NetCDF library version: netCDF 4.7.4
NetCDF Fortran version: netCDF-Fortran 4.5.3
 
--------------------------------------------------------------
 * User set ESMF environment variables *
ESMF_ABI=64
ESMF_BOPT=g
ESMF_COMM=mpiuni
ESMF_COMPILER=gfortranclang
ESMF_DIR=/project/esmf/himanshu/esmf_test/cronjobs/daily/gfortran_clang/esmf
ESMF_INSTALL_PREFIX=/project/esmf/himanshu/esmf_test/cronjobs/daily/gfortran_clang/install_dir
ESMF_NETCDF=nc-config
ESMF_OS=Darwin
ESMF_SITE=default
ESMF_TESTEXHAUSTIVE=ON
ESMF_TESTMPMD=OFF
ESMF_TESTWITHTHREADS=ON
 
--------------------------------------------------------------
 * ESMF environment variables *
ESMF_DIR: /project/esmf/himanshu/esmf_test/cronjobs/daily/gfortran_clang/esmf
ESMF_OS:                Darwin
ESMF_MACHINE:           x86_64
ESMF_ABI:               64
ESMF_COMPILER:          gfortranclang
ESMF_BOPT:              g
ESMF_COMM:              mpiuni
ESMF_SITE:              default
ESMF_PTHREADS:          OFF
ESMF_OPENMP:            OFF
ESMF_OPENACC:           OFF
ESMF_CXXSTD:            11
ESMF_ARRAY_LITE:        FALSE
ESMF_NO_INTEGER_1_BYTE: TRUE
ESMF_NO_INTEGER_2_BYTE: TRUE
ESMF_FORTRANSYMBOLS:    default
ESMF_MAPPER_BUILD:      OFF
ESMF_AUTO_LIB_BUILD:    ON
ESMF_DEFER_LIB_BUILD:   ON
ESMF_SHARED_LIB_BUILD:  ON
ESMF_TRACE_LIB_BUILD:   ON
ESMF_TESTEXHAUSTIVE:    ON
ESMF_TESTCOMPTUNNEL:    ON
ESMF_TESTWITHTHREADS:   ON
ESMF_TESTMPMD:          OFF
ESMF_TESTSHAREDOBJ:     OFF
ESMF_TESTFORCEOPENMP:   OFF
ESMF_TESTFORCEOPENACC:  OFF
ESMF_TESTHARNESS_ARRAY: default
ESMF_TESTHARNESS_FIELD: default
ESMF_MPIRUN:            /project/esmf/himanshu/esmf_test/cronjobs/daily/gfortran_clang/esmf/src/Infrastructure/stubs/mpiuni/mpirun
 
--------------------------------------------------------------
 * ESMF environment variables pointing to 3rd party software *
ESMF_MOAB:               internal
ESMF_LAPACK:             internal
ESMF_ACC_SOFTWARE_STACK: none
ESMF_NETCDF:             nc-config
ESMF_NETCDF_INCLUDE:     /project/esmf/GCC/Homebrew/9.3.0_1/netcdf/4.7.4/include
ESMF_NETCDF_LIBS:        -lnetcdf
ESMF_NETCDF_LIBPATH:     /project/esmf/GCC/Homebrew/9.3.0_1/netcdf/4.7.4/lib
ESMF_NFCONFIG:           nf-config
ESMF_NETCDFF_INCLUDE:    /project/esmf/GCC/Homebrew/9.3.0_1/netcdf/4.7.4/include
ESMF_NETCDFF_LIBS:       -lnetcdff
ESMF_NETCDFF_LIBPATH:    /project/esmf/GCC/Homebrew/9.3.0_1/netcdf/4.7.4/lib
ESMF_YAMLCPP:            internal
 
--------------------------------------------------------------
 * ESMF environment variables for final installation *
ESMF_INSTALL_PREFIX:    /project/esmf/himanshu/esmf_test/cronjobs/daily/gfortran_clang/install_dir
ESMF_INSTALL_HEADERDIR: include
ESMF_INSTALL_MODDIR:    mod/modg/Darwin.gfortranclang.64.mpiuni.default
ESMF_INSTALL_LIBDIR:    lib/libg/Darwin.gfortranclang.64.mpiuni.default
ESMF_INSTALL_BINDIR:    bin/bing/Darwin.gfortranclang.64.mpiuni.default
ESMF_INSTALL_DOCDIR:    doc
 
--------------------------------------------------------------
 * ESMF Benchmark directory and parameters *
ESMF_BENCHMARK_PREFIX:         ./DEFAULTBENCHMARKDIR
ESMF_BENCHMARK_TOLERANCE:      20%
ESMF_BENCHMARK_THRESHOLD_MSEC: 500
 
--------------------------------------------------------------
 * Other relevant environment variables *
PATH:    /project/esmf/GCC/Homebrew/9.3.0_1/netcdf/4.7.4/bin:/project/esmf/GCC/Homebrew/9.3.0_1:/project/esmf/Modules/bin:/home/himanshu/bin:/usr/local/bin:/usr/bin:/bin:/usr/sbin:/sbin:/opt/local/bin:/opt/local/sbin:/opt/X11/bin
LD_LIBRARY_PATH: 
 
--------------------------------------------------------------
 * Compilers, Linkers, Flags, and Libraries *
Location of the preprocessor:      /usr/bin/clang
Location of the Fortran compiler:  /usr/local/bin/gfortran
Location of the Fortran linker:    /usr/local/bin/gfortran
Location of the C++ compiler:      /usr/bin/clang
Location of the C++ linker:        /usr/bin/clang

Fortran compiler flags:
ESMF_F90COMPILER: gfortran
ESMF_F90COMPILEOPTS: -g -Wall -Wno-unused -Wno-unused-dummy-argument -fbacktrace -fbounds-check   -m64 -mcmodel=small -ffree-line-length-none
ESMF_F90COMPILEPATHS: -I/project/esmf/himanshu/esmf_test/cronjobs/daily/gfortran_clang/esmf/mod/modg/Darwin.gfortranclang.64.mpiuni.default -I/project/esmf/himanshu/esmf_test/cronjobs/daily/gfortran_clang/esmf/src/include -I/project/esmf/GCC/Homebrew/9.3.0_1/netcdf/4.7.4/include -I/project/esmf/GCC/Homebrew/9.3.0_1/netcdf/4.7.4/include
ESMF_F90COMPILECPPFLAGS: -DESMF_NO_INTEGER_1_BYTE -DESMF_NO_INTEGER_2_BYTE -DESMFVERSIONGIT='ESMF_8_1_0_beta_snapshot_25-23-g5724188759' -DESMF_MOAB=1 -DESMF_LAPACK=1 -DESMF_LAPACK_INTERNAL=1 -DESMF_NO_ACC_SOFTWARE_STACK=1 -DESMF_NETCDF=1 -DESMF_YAMLCPP=1 -DESMF_YAML=1 -DESMF_NO_PTHREADS -DESMF_NO_OPENMP -DESMF_NO_OPENACC -DESMF_TESTEXHAUSTIVE -DESMF_BOPT_g -DESMF_TESTCOMPTUNNEL -DESMF_TESTWITHTHREADS -DSx86_64_small=1 -DESMF_OS_Darwin=1 -DESMF_COMM=mpiuni -DESMF_DIR=/project/esmf/himanshu/esmf_test/cronjobs/daily/gfortran_clang/esmf -DESMF_MPIUNI
ESMF_F90COMPILEFREECPP: 
ESMF_F90COMPILEFREENOCPP: -ffree-form
ESMF_F90COMPILEFIXCPP: -cpp -ffixed-form
ESMF_F90COMPILEFIXNOCPP: 

Fortran linker flags:
ESMF_F90LINKOPTS:    -m64 -mcmodel=small
ESMF_F90LINKPATHS: -L/project/esmf/himanshu/esmf_test/cronjobs/daily/gfortran_clang/esmf/lib/libg/Darwin.gfortranclang.64.mpiuni.default -L/project/esmf/GCC/Homebrew/9.3.0_1/netcdf/4.7.4/lib -L/project/esmf/GCC/Homebrew/9.3.0_1/netcdf/4.7.4/lib
ESMF_F90LINKRPATHS: -Wl,-rpath,/project/esmf/himanshu/esmf_test/cronjobs/daily/gfortran_clang/esmf/lib/libg/Darwin.gfortranclang.64.mpiuni.default -Wl,-rpath,/project/esmf/GCC/Homebrew/9.3.0_1/netcdf/4.7.4/lib -Wl,-rpath,/project/esmf/GCC/Homebrew/9.3.0_1/netcdf/4.7.4/lib
ESMF_F90LINKLIBS:  -lstdc++ -lc++ -lnetcdf -lnetcdff
ESMF_F90ESMFLINKLIBS: -lesmf  -lstdc++ -lc++ -lnetcdf -lnetcdff

C++ compiler flags:
ESMF_CXXCOMPILER: clang
ESMF_CXXCOMPILEOPTS: -std=c++11 -g -Wall -Wextra -Wno-unused  -DESMF_LOWERCASE_SINGLEUNDERSCORE -m64 -mcmodel=small
ESMF_CXXCOMPILEPATHS:  -I/project/esmf/himanshu/esmf_test/cronjobs/daily/gfortran_clang/esmf/src/include  -I/project/esmf/GCC/Homebrew/9.3.0_1/netcdf/4.7.4/include -I/project/esmf/himanshu/esmf_test/cronjobs/daily/gfortran_clang/esmf/src/Infrastructure/stubs/mpiuni -I/project/esmf/himanshu/esmf_test/cronjobs/daily/gfortran_clang/esmf/src/prologue/yaml-cpp/include
ESMF_CXXCOMPILECPPFLAGS: -DESMF_NO_INTEGER_1_BYTE -DESMF_NO_INTEGER_2_BYTE -DESMFVERSIONGIT='ESMF_8_1_0_beta_snapshot_25-23-g5724188759' -DESMF_MOAB=1 -DESMF_LAPACK=1 -DESMF_LAPACK_INTERNAL=1 -DESMF_NO_ACC_SOFTWARE_STACK=1 -DESMF_NETCDF=1 -DESMF_YAMLCPP=1 -DESMF_YAML=1 -DESMF_NO_PTHREADS -DESMF_NO_OPENMP -DESMF_NO_OPENACC -DESMF_TESTEXHAUSTIVE -DESMF_BOPT_g -DESMF_TESTCOMPTUNNEL -DESMF_TESTWITHTHREADS -DSx86_64_small=1 -DESMF_OS_Darwin=1 -DESMF_COMM=mpiuni -DESMF_DIR=/project/esmf/himanshu/esmf_test/cronjobs/daily/gfortran_clang/esmf -D__SDIR__='' -DESMF_CXXSTD=11 -x c++ -DESMF_MPIUNI

C++ linker flags:
ESMF_CXXLINKOPTS:   -m64 -mcmodel=small
ESMF_CXXLINKPATHS: -L/project/esmf/himanshu/esmf_test/cronjobs/daily/gfortran_clang/esmf/lib/libg/Darwin.gfortranclang.64.mpiuni.default -L/project/esmf/GCC/Homebrew/9.3.0_1/netcdf/4.7.4/lib -L/project/esmf/GCC/Homebrew/9.3.0_1/netcdf/4.7.4/lib -L/usr/local/Cellar/gcc/10.1.0/lib/gcc/10/gcc/x86_64-apple-darwin18/10.1.0/../../../
ESMF_CXXLINKRPATHS: -Wl,-rpath,/project/esmf/himanshu/esmf_test/cronjobs/daily/gfortran_clang/esmf/lib/libg/Darwin.gfortranclang.64.mpiuni.default -Wl,-rpath,/project/esmf/GCC/Homebrew/9.3.0_1/netcdf/4.7.4/lib -Wl,-rpath,/project/esmf/GCC/Homebrew/9.3.0_1/netcdf/4.7.4/lib -Wl,-rpath,/usr/local/Cellar/gcc/10.1.0/lib/gcc/10/gcc/x86_64-apple-darwin18/10.1.0/../../../
ESMF_CXXLINKLIBS:  -lgfortran -lstdc++ -lc++ -lnetcdf -lnetcdff
ESMF_CXXESMFLINKLIBS: -lesmf  -lgfortran -lstdc++ -lc++ -lnetcdf -lnetcdff

Shared library build:
ESMF_SL_LIBS_TO_MAKE: libesmf
ESMF_SL_SUFFIX:       dylib
ESMF_SL_LIBLINKER:    clang
ESMF_SL_LIBOPTS:       -dynamiclib
ESMF_SL_LIBLIBS:       -L/project/esmf/himanshu/esmf_test/cronjobs/daily/gfortran_clang/esmf/lib/libg/Darwin.gfortranclang.64.mpiuni.default -L/project/esmf/GCC/Homebrew/9.3.0_1/netcdf/4.7.4/lib -L/project/esmf/GCC/Homebrew/9.3.0_1/netcdf/4.7.4/lib  -lstdc++ -lc++ -lnetcdf -lnetcdff -L/project/esmf/himanshu/esmf_test/cronjobs/daily/gfortran_clang/esmf/lib/libg/Darwin.gfortranclang.64.mpiuni.default -L/project/esmf/GCC/Homebrew/9.3.0_1/netcdf/4.7.4/lib -L/project/esmf/GCC/Homebrew/9.3.0_1/netcdf/4.7.4/lib -L/usr/local/Cellar/gcc/10.1.0/lib/gcc/10/gcc/x86_64-apple-darwin18/10.1.0/../../../  -lgfortran -lstdc++ -lc++ -lnetcdf -lnetcdff

ESMF Tracing linker options:
ESMF_TRACE_LDPRELOAD=/project/esmf/himanshu/esmf_test/cronjobs/daily/gfortran_clang/esmf/lib/libg/Darwin.gfortranclang.64.mpiuni.default/libesmftrace_preload.dylib
ESMF_TRACE_STATICLINKOPTS=-static -Wl,--wrap=c_esmftrace_notify_wrappers -Wl,--wrap=c_esmftrace_isinitialized -Wl,--wrap=write -Wl,--wrap=writev -Wl,--wrap=pwrite -Wl,--wrap=read -Wl,--wrap=open -Wl,--wrap=MPI_Allgather -Wl,--wrap=MPI_Allgatherv -Wl,--wrap=MPI_Allreduce -Wl,--wrap=MPI_Alltoall -Wl,--wrap=MPI_Alltoallv -Wl,--wrap=MPI_Alltoallw -Wl,--wrap=MPI_Barrier -Wl,--wrap=MPI_Bcast -Wl,--wrap=MPI_Gather -Wl,--wrap=MPI_Gatherv -Wl,--wrap=MPI_Recv -Wl,--wrap=MPI_Reduce -Wl,--wrap=MPI_Scatter -Wl,--wrap=MPI_Send -Wl,--wrap=MPI_Sendrecv -Wl,--wrap=MPI_Wait -Wl,--wrap=MPI_Waitall -Wl,--wrap=MPI_Waitany -Wl,--wrap=MPI_Waitsome -Wl,--wrap=mpi_allgather_ -Wl,--wrap=mpi_allgather__ -Wl,--wrap=mpi_allgatherv_ -Wl,--wrap=mpi_allgatherv__ -Wl,--wrap=mpi_allreduce_ -Wl,--wrap=mpi_allreduce__ -Wl,--wrap=mpi_alltoall_ -Wl,--wrap=mpi_alltoall__ -Wl,--wrap=mpi_alltoallv_ -Wl,--wrap=mpi_alltoallv__ -Wl,--wrap=mpi_alltoallw_ -Wl,--wrap=mpi_alltoallw__ -Wl,--wrap=mpi_barrier_ -Wl,--wrap=mpi_barrier__ -Wl,--wrap=mpi_bcast_ -Wl,--wrap=mpi_bcast__ -Wl,--wrap=mpi_exscan_ -Wl,--wrap=mpi_exscan__ -Wl,--wrap=mpi_gather_ -Wl,--wrap=mpi_gather__ -Wl,--wrap=mpi_gatherv_ -Wl,--wrap=mpi_gatherv__ -Wl,--wrap=mpi_recv_ -Wl,--wrap=mpi_recv__ -Wl,--wrap=mpi_reduce_ -Wl,--wrap=mpi_reduce__ -Wl,--wrap=mpi_reduce_scatter_ -Wl,--wrap=mpi_reduce_scatter__ -Wl,--wrap=mpi_scatter_ -Wl,--wrap=mpi_scatter__ -Wl,--wrap=mpi_scatterv_ -Wl,--wrap=mpi_scatterv__ -Wl,--wrap=mpi_scan_ -Wl,--wrap=mpi_scan__ -Wl,--wrap=mpi_send_ -Wl,--wrap=mpi_send__ -Wl,--wrap=mpi_wait_ -Wl,--wrap=mpi_wait__ -Wl,--wrap=mpi_waitall_ -Wl,--wrap=mpi_waitall__ -Wl,--wrap=mpi_waitany_ -Wl,--wrap=mpi_waitany__
ESMF_TRACE_STATICLINKLIBS=-lesmftrace_static


--------------------------------------------------------------
Compiling on Sat Aug 15 19:10:51 MDT 2020 on cgdm-catania
Machine characteristics: Darwin cgdm-catania 18.7.0 Darwin Kernel Version 18.7.0: Tue Aug 20 16:57:14 PDT 2019; root:xnu-4903.271.2~2/RELEASE_X86_64 x86_64
==============================================================
 
Sat Aug 15 19:21:36 MDT 2020 library build ................PASS
Builds with warnings.
Sat Aug 15 19:22:10 MDT 2020 library install ..............PASS
Sat Aug 15 19:22:19 MDT 2020 library installcheck .........PASS
Sat Aug 15 19:23:22 MDT 2020 quickstart build .............PASS

|------------------------ APPs TESTS --------------------------|
Sat Aug 15 19:23:25 MDT 2020 apps build ...................PASS

|--------------------------------------------------------------|
Sat Aug 15 19:23:27 MDT 2020 ESMF_Regrid --help ***********FAIL
The following is the output of ESMF_Regrid --help

dyld: Library not loaded: /usr/local/opt/gcc/lib/gcc/9/libgfortran.5.dylib
  Referenced from: /project/esmf/GCC/Homebrew/9.3.0_1/netcdf/4.7.4/lib/libnetcdff.7.dylib
  Reason: image not found



|--------------------------------------------------------------|
Sat Aug 15 19:23:28 MDT 2020 ESMF_Regrid --version ********FAIL
The following is the output of ESMF_Regrid --version

dyld: Library not loaded: /usr/local/opt/gcc/lib/gcc/9/libgfortran.5.dylib
  Referenced from: /project/esmf/GCC/Homebrew/9.3.0_1/netcdf/4.7.4/lib/libnetcdff.7.dylib
  Reason: image not found



|--------------------------------------------------------------|
Sat Aug 15 19:23:28 MDT 2020 ESMF_Regrid -V ***************FAIL
The following is the output of ESMF_Regrid -V

dyld: Library not loaded: /usr/local/opt/gcc/lib/gcc/9/libgfortran.5.dylib
  Referenced from: /project/esmf/GCC/Homebrew/9.3.0_1/netcdf/4.7.4/lib/libnetcdff.7.dylib
  Reason: image not found



|--------------------------------------------------------------|
Sat Aug 15 19:23:28 MDT 2020 ESMF_Info --help *************FAIL
The following is the output of ESMF_Info --help 

dyld: Library not loaded: /usr/local/opt/gcc/lib/gcc/9/libgfortran.5.dylib
  Referenced from: /project/esmf/GCC/Homebrew/9.3.0_1/netcdf/4.7.4/lib/libnetcdff.7.dylib
  Reason: image not found



|--------------------------------------------------------------|
Sat Aug 15 19:23:28 MDT 2020 ESMF_Info --version **********FAIL
The following is the output of ESMF_Info --version 

dyld: Library not loaded: /usr/local/opt/gcc/lib/gcc/9/libgfortran.5.dylib
  Referenced from: /project/esmf/GCC/Homebrew/9.3.0_1/netcdf/4.7.4/lib/libnetcdff.7.dylib
  Reason: image not found



|--------------------------------------------------------------|
Sat Aug 15 19:23:30 MDT 2020 ESMF_Info -V *****************FAIL
The following is the output of ESMF_Info -V 

dyld: Library not loaded: /usr/local/opt/gcc/lib/gcc/9/libgfortran.5.dylib
  Referenced from: /project/esmf/GCC/Homebrew/9.3.0_1/netcdf/4.7.4/lib/libnetcdff.7.dylib
  Reason: image not found



|--------------------------------------------------------------|
Sat Aug 15 19:23:30 MDT 2020 ESMF_InfoC --help ************FAIL
The following is the output of ESMF_InfoC --help

dyld: Library not loaded: /usr/local/opt/gcc/lib/gcc/9/libgfortran.5.dylib
  Referenced from: /project/esmf/GCC/Homebrew/9.3.0_1/netcdf/4.7.4/lib/libnetcdff.7.dylib
  Reason: image not found



|--------------------------------------------------------------|
Sat Aug 15 19:23:30 MDT 2020 ESMF_InfoC --version *********FAIL
The following is the output of ESMF_InfoC --version

dyld: Library not loaded: /usr/local/opt/gcc/lib/gcc/9/libgfortran.5.dylib
  Referenced from: /project/esmf/GCC/Homebrew/9.3.0_1/netcdf/4.7.4/lib/libnetcdff.7.dylib
  Reason: image not found



|--------------------------------------------------------------|
Sat Aug 15 19:23:30 MDT 2020 ESMF_InfoC -V ****************FAIL
The following is the output of ESMF_InfoC -V

dyld: Library not loaded: /usr/local/opt/gcc/lib/gcc/9/libgfortran.5.dylib
  Referenced from: /project/esmf/GCC/Homebrew/9.3.0_1/netcdf/4.7.4/lib/libnetcdff.7.dylib
  Reason: image not found



|--------------------------------------------------------------|
Sat Aug 15 19:23:31 MDT 2020 ESMF_RegridWeightGen --help **FAIL
The following is the output of ESMF_RegridWeightGen --help

dyld: Library not loaded: /usr/local/opt/gcc/lib/gcc/9/libgfortran.5.dylib
  Referenced from: /project/esmf/GCC/Homebrew/9.3.0_1/netcdf/4.7.4/lib/libnetcdff.7.dylib
  Reason: image not found



|--------------------------------------------------------------|
Sat Aug 15 19:23:31 MDT 2020 ESMF_RegridWeightGen --version FAIL
The following is the output of ESMF_RegridWeightGen --version

dyld: Library not loaded: /usr/local/opt/gcc/lib/gcc/9/libgfortran.5.dylib
  Referenced from: /project/esmf/GCC/Homebrew/9.3.0_1/netcdf/4.7.4/lib/libnetcdff.7.dylib
  Reason: image not found



|--------------------------------------------------------------|
Sat Aug 15 19:23:31 MDT 2020 ESMF_RegridWeightGen -V ******FAIL
The following is the output of ESMF_RegridWeightGen -V

dyld: Library not loaded: /usr/local/opt/gcc/lib/gcc/9/libgfortran.5.dylib
  Referenced from: /project/esmf/GCC/Homebrew/9.3.0_1/netcdf/4.7.4/lib/libnetcdff.7.dylib
  Reason: image not found



|--------------------------------------------------------------|
Sat Aug 15 19:23:31 MDT 2020 ESMF_Scrip2Unstruct --help ***FAIL
The following is the output of ESMF_Scrip2Unstruct --help

dyld: Library not loaded: /usr/local/opt/gcc/lib/gcc/9/libgfortran.5.dylib
  Referenced from: /project/esmf/GCC/Homebrew/9.3.0_1/netcdf/4.7.4/lib/libnetcdff.7.dylib
  Reason: image not found



|--------------------------------------------------------------|
Sat Aug 15 19:23:31 MDT 2020 ESMF_Scrip2Unstruct --version FAIL
The following is the output of ESMF_Scrip2Unstruct --version

dyld: Library not loaded: /usr/local/opt/gcc/lib/gcc/9/libgfortran.5.dylib
  Referenced from: /project/esmf/GCC/Homebrew/9.3.0_1/netcdf/4.7.4/lib/libnetcdff.7.dylib
  Reason: image not found



|--------------------------------------------------------------|
Sat Aug 15 19:23:31 MDT 2020 ESMF_Scrip2Unstruct -V *******FAIL
The following is the output of ESMF_Scrip2Unstruct -V

dyld: Library not loaded: /usr/local/opt/gcc/lib/gcc/9/libgfortran.5.dylib
  Referenced from: /project/esmf/GCC/Homebrew/9.3.0_1/netcdf/4.7.4/lib/libnetcdff.7.dylib
  Reason: image not found



|--------------------------------------------------------------|
Sat Aug 15 19:23:31 MDT 2020 ESMF_WebServController --help FAIL
The following is the output of ESMF_WebServController --help

dyld: Library not loaded: /usr/local/opt/gcc/lib/gcc/9/libgfortran.5.dylib
  Referenced from: /project/esmf/GCC/Homebrew/9.3.0_1/netcdf/4.7.4/lib/libnetcdff.7.dylib
  Reason: image not found



|--------------------------------------------------------------|
Sat Aug 15 19:23:31 MDT 2020 ESMF_WebServController --version FAIL
The following is the output of ESMF_WebServController --version

dyld: Library not loaded: /usr/local/opt/gcc/lib/gcc/9/libgfortran.5.dylib
  Referenced from: /project/esmf/GCC/Homebrew/9.3.0_1/netcdf/4.7.4/lib/libnetcdff.7.dylib
  Reason: image not found



|--------------------------------------------------------------|
Sat Aug 15 19:23:31 MDT 2020 ESMF_WebServController -V ****FAIL
The following is the output of ESMF_WebServController -V

dyld: Library not loaded: /usr/local/opt/gcc/lib/gcc/9/libgfortran.5.dylib
  Referenced from: /project/esmf/GCC/Homebrew/9.3.0_1/netcdf/4.7.4/lib/libnetcdff.7.dylib
  Reason: image not found




Ran 18 applications tests, 0 passed and 18 failed.

|----------------------- SYSTEM TESTS -------------------------|
Sat Aug 15 19:25:16 MDT 2020 build_system_tests ...........PASS
Sat Aug 15 19:25:30 MDT 2020 run_system_tests_uni .........PASS
The following system tests failed, did not build, or did not execute:


FAIL: mpiuni/g: src/system_tests/ESMF_ArraySharedDeSSI/ESMF_ArraySharedDeSSISTest.F90
FAIL: mpiuni/g: src/system_tests/ESMF_CompCreate/ESMF_CompCreateSTest.F90
FAIL: mpiuni/g: src/system_tests/ESMF_CompFortranAndC/ESMF_CompFortranAndCSTest.F90
FAIL: mpiuni/g: src/system_tests/ESMF_FieldBundleRedistArb2Arb/ESMF_FieldBundleRedistArb2ArbSTest.F90
FAIL: mpiuni/g: src/system_tests/ESMF_FieldBundleRedistBlk2Arb/ESMF_FieldBundleRedistBlk2ArbSTest.F90
FAIL: mpiuni/g: src/system_tests/ESMF_FieldRedistArb2Arb/ESMF_FieldRedistArb2ArbSTest.F90
FAIL: mpiuni/g: src/system_tests/ESMF_XGridSerial/ESMF_XGridSerialSTest.F90


NOTE: There are no executable system test files, either the 'gmake ESMF_BOPT=g build_system_tests' has 
not been run or the 'gmake ESMF_BOPT=g' did not build successfully. 



The stdout files for the system_tests can be found at:
/project/esmf/himanshu/esmf_test/cronjobs/daily/gfortran_clang/esmf/test/testg/Darwin.gfortranclang.64.mpiuni.default


Found 7 single processor system tests, 0 passed and 7 failed.



|------------------------- EXAMPLES ---------------------------|
Sat Aug 15 19:28:19 MDT 2020 build_examples ...............PASS
Sat Aug 15 19:29:43 MDT 2020 run_examples_uni .............PASS
The following examples failed, did not build, or did not execute:


FAIL: mpiuni/g: src/Infrastructure/ArraySpec/examples/ESMF_ArraySpecEx.F90
FAIL: mpiuni/g: src/Infrastructure/Config/examples/ESMF_ConfigOverviewEx.F90
FAIL: mpiuni/g: src/Infrastructure/DELayout/examples/ESMF_DELayoutEx.F90
FAIL: mpiuni/g: src/Infrastructure/Field/examples/ESMF_FieldArbGridEx.F90
FAIL: mpiuni/g: src/Infrastructure/FieldBundle/examples/ESMF_FieldBundleCreateEx.F90
FAIL: mpiuni/g: src/Infrastructure/Grid/examples/ESMF_GridCreateRegFromDGEx.F90
FAIL: mpiuni/g: src/Infrastructure/Grid/examples/ESMF_GridUsageEx.F90
FAIL: mpiuni/g: src/Infrastructure/LocStream/examples/ESMF_LocStreamEx.F90
FAIL: mpiuni/g: src/Infrastructure/LogErr/examples/ESMF_LogErrEx.F90
FAIL: mpiuni/g: src/Infrastructure/Route/examples/ESMF_RHandleDynamicMaskingEx.F90
FAIL: mpiuni/g: src/Infrastructure/Route/examples/ESMF_RHandleFromFileEx.F90
FAIL: mpiuni/g: src/Infrastructure/Route/examples/ESMF_RHandleReusabilityEx.F90
FAIL: mpiuni/g: src/Infrastructure/TimeMgr/examples/ESMF_AlarmEx.F90
FAIL: mpiuni/g: src/Infrastructure/TimeMgr/examples/ESMF_CalendarEx.F90
FAIL: mpiuni/g: src/Infrastructure/TimeMgr/examples/ESMF_ClockEx.F90
FAIL: mpiuni/g: src/Infrastructure/TimeMgr/examples/ESMF_TimeEx.F90
FAIL: mpiuni/g: src/Infrastructure/TimeMgr/examples/ESMF_TimeIntervalEx.F90
FAIL: mpiuni/g: src/Infrastructure/Trace/examples/ESMF_TraceEx.F90
FAIL: mpiuni/g: src/Infrastructure/Trace/examples/ESMF_TraceUserEx.F90
FAIL: mpiuni/g: src/Infrastructure/VM/examples/ESMF_VMAllFullReduceEx.F90
FAIL: mpiuni/g: src/Infrastructure/VM/examples/ESMF_VMComponentEx.F90
FAIL: mpiuni/g: src/Infrastructure/VM/examples/ESMF_VMDefaultBasicsEx.F90
FAIL: mpiuni/g: src/Infrastructure/VM/examples/ESMF_VMGetMPICommunicatorEx.F90
FAIL: mpiuni/g: src/Infrastructure/VM/examples/ESMF_VMHigherRankDataEx.F90
FAIL: mpiuni/g: src/Infrastructure/VM/examples/ESMF_VMNonBlockingEx.F90
FAIL: mpiuni/g: src/Infrastructure/VM/examples/ESMF_VMScatterVMGatherEx.F90
FAIL: mpiuni/g: src/Infrastructure/VM/examples/ESMF_VMSendVMRecvEx.F90
FAIL: mpiuni/g: src/Infrastructure/VM/examples/ESMF_VMUserMpiCommEx.F90
FAIL: mpiuni/g: src/Infrastructure/VM/examples/ESMF_VMUserMpiCommMultiEx.F90
FAIL: mpiuni/g: src/Infrastructure/VM/examples/ESMF_VMUserMpiEx.F90
FAIL: mpiuni/g: src/Infrastructure/XGrid/examples/ESMF_XGridSparseMatEx.F90
FAIL: mpiuni/g: src/Superstructure/AttachMethods/examples/ESMF_AttachMethodsEx.F90
FAIL: mpiuni/g: src/Superstructure/Component/examples/ESMF_AppMainEx.F90
FAIL: mpiuni/g: src/Superstructure/Component/examples/ESMF_CplEx.F90
FAIL: mpiuni/g: src/Superstructure/Component/examples/ESMF_GCompEx.F90
FAIL: mpiuni/g: src/Superstructure/Component/examples/ESMF_InternalStateEx.F90
FAIL: mpiuni/g: src/Superstructure/Component/examples/ESMF_InternalStateModEx.F90
FAIL: mpiuni/g: src/Superstructure/Component/examples/ESMF_SCompEx.F90
FAIL: mpiuni/g: src/Superstructure/State/examples/ESMF_StateEx.F90
FAIL: mpiuni/g: src/Superstructure/State/examples/ESMF_StateReadWriteEx.F90
FAIL: mpiuni/g: src/Superstructure/State/examples/ESMF_StateReconcileEx.F90
FAIL: mpiuni/g: src/addon/NUOPC/examples/ESMF_NUOPCAtmModelEx.F90
FAIL: mpiuni/g: src/addon/NUOPC/examples/ESMF_NUOPCBasicModelEx.F90




The stdout files for the examples can be found at:
/project/esmf/himanshu/esmf_test/cronjobs/daily/gfortran_clang/esmf/examples/examplesg/Darwin.gfortranclang.64.mpiuni.default


Found 43 single processor examples, 0 passed and 43 failed.



|-------------------- EXHAUSTIVE UNIT TESTS -------------------|
Sat Aug 15 19:34:16 MDT 2020 build_unit_tests *************FAIL


The following is the 'tail' of the build_unit_tests failure

/project/esmf/himanshu/esmf_test/cronjobs/daily/gfortran_clang/esmf/src/Infrastructure/Mesh/include/sacado/Sacado_tradvec.hpp:1432:35: warning: unused parameter 'n' [-Wunused-parameter]
IndepADvar::Wantderiv(int n)
                                  ^
In file included from ESMC_NearestUTest.C:24:
In file included from /project/esmf/himanshu/esmf_test/cronjobs/daily/gfortran_clang/esmf/src/Infrastructure/Mesh/tests/ESMC_MBMeshTestUtilPL.C:25:
In file included from /project/esmf/himanshu/esmf_test/cronjobs/daily/gfortran_clang/esmf/src/Infrastructure/Mesh/tests/../include/ESMCI_Regrid_Nearest.h:16:
In file included from /project/esmf/himanshu/esmf_test/cronjobs/daily/gfortran_clang/esmf/src/Infrastructure/Mesh/include/Regridding/ESMCI_WMat.h:15:
In file included from /project/esmf/himanshu/esmf_test/cronjobs/daily/gfortran_clang/esmf/src/Infrastructure/Mesh/include/Legacy/ESMCI_Migrator.h:18:
/project/esmf/himanshu/esmf_test/cronjobs/daily/gfortran_clang/esmf/src/Infrastructure/Mesh/include/Legacy/ESMCI_ParEnv.h:66:39: warning: unused parameter 't' [-Wunused-parameter]
  MeshNullStream& operator<<(const T &t) {return *this; }
                                      ^
/project/esmf/himanshu/esmf_test/cronjobs/daily/gfortran_clang/esmf/src/Infrastructure/Mesh/include/Legacy/ESMCI_ParEnv.h:68:46: warning: unused parameter 'f' [-Wunused-parameter]
  MeshNullStream& operator<<(std::ostream &(*f)(std::ostream &t)) { return *this; }
                                             ^
In file included from ESMC_NearestUTest.C:24:
In file included from /project/esmf/himanshu/esmf_test/cronjobs/daily/gfortran_clang/esmf/src/Infrastructure/Mesh/tests/ESMC_MBMeshTestUtilPL.C:25:
In file included from /project/esmf/himanshu/esmf_test/cronjobs/daily/gfortran_clang/esmf/src/Infrastructure/Mesh/tests/../include/ESMCI_Regrid_Nearest.h:16:
In file included from /project/esmf/himanshu/esmf_test/cronjobs/daily/gfortran_clang/esmf/src/Infrastructure/Mesh/include/Regridding/ESMCI_WMat.h:15:
/project/esmf/himanshu/esmf_test/cronjobs/daily/gfortran_clang/esmf/src/Infrastructure/Mesh/include/Legacy/ESMCI_Migrator.h:121:33: warning: unused parameter 'r' [-Wunused-parameter]
void Migrator::Migrate(T &t, R &r, bool obj_equal) {
                                ^
In file included from ESMC_NearestUTest.C:24:
/project/esmf/himanshu/esmf_test/cronjobs/daily/gfortran_clang/esmf/src/Infrastructure/Mesh/tests/ESMC_MBMeshTestUtilPL.C:54:24: warning: comparison of integers of different signs: 'std::__1::vector >::size_type' (aka 'unsigned long') and 'int' [-Wsign-compare]
    if (weights.size() != ind) correct = false;
        ~~~~~~~~~~~~~~ ^  ~~~
ESMC_NearestUTest.C:41:14: warning: unused parameter 'argc' [-Wunused-parameter]
int main(int argc, char *argv[]) {
             ^
ESMC_NearestUTest.C:41:26: warning: unused parameter 'argv' [-Wunused-parameter]
int main(int argc, char *argv[]) {
                         ^
83 warnings generated.
clang   -m64 -mcmodel=small -L/project/esmf/himanshu/esmf_test/cronjobs/daily/gfortran_clang/esmf/lib/libg/Darwin.gfortranclang.64.mpiuni.default -L/project/esmf/GCC/Homebrew/9.3.0_1/netcdf/4.7.4/lib -L/project/esmf/GCC/Homebrew/9.3.0_1/netcdf/4.7.4/lib -L/usr/local/Cellar/gcc/10.1.0/lib/gcc/10/gcc/x86_64-apple-darwin18/10.1.0/../../../ -Wl,-rpath,/project/esmf/himanshu/esmf_test/cronjobs/daily/gfortran_clang/esmf/lib/libg/Darwin.gfortranclang.64.mpiuni.default -Wl,-rpath,/project/esmf/GCC/Homebrew/9.3.0_1/netcdf/4.7.4/lib -Wl,-rpath,/project/esmf/GCC/Homebrew/9.3.0_1/netcdf/4.7.4/lib -Wl,-rpath,/usr/local/Cellar/gcc/10.1.0/lib/gcc/10/gcc/x86_64-apple-darwin18/10.1.0/../../../ -o /project/esmf/himanshu/esmf_test/cronjobs/daily/gfortran_clang/esmf/test/testg/Darwin.gfortranclang.64.mpiuni.default/ESMC_NearestUTest  ESMC_NearestUTest.o -lesmf  -lgfortran -lstdc++ -lc++ -lnetcdf -lnetcdff
rm -rf -f *.o *.mod
gfortran -c -g -Wall -Wno-unused -Wno-unused-dummy-argument -fbacktrace -fbounds-check   -m64 -mcmodel=small -ffree-line-length-none  -I/project/esmf/himanshu/esmf_test/cronjobs/daily/gfortran_clang/esmf/build_config/Darwin.gfortranclang.default -I/project/esmf/himanshu/esmf_test/cronjobs/daily/gfortran_clang/esmf/src/Infrastructure -I/project/esmf/himanshu/esmf_test/cronjobs/daily/gfortran_clang/esmf/src/Superstructure -I/project/esmf/himanshu/esmf_test/cronjobs/daily/gfortran_clang/esmf/mod/modg/Darwin.gfortranclang.64.mpiuni.default -I/project/esmf/himanshu/esmf_test/cronjobs/daily/gfortran_clang/esmf/src/include -I/project/esmf/GCC/Homebrew/9.3.0_1/netcdf/4.7.4/include -I/project/esmf/GCC/Homebrew/9.3.0_1/netcdf/4.7.4/include  -DESMF_NO_INTEGER_1_BYTE -DESMF_NO_INTEGER_2_BYTE -DESMFVERSIONGIT='"ESMF_8_1_0_beta_snapshot_25-23-g5724188759"' -DESMF_MOAB=1 -DESMF_LAPACK=1 -DESMF_LAPACK_INTERNAL=1 -DESMF_NO_ACC_SOFTWARE_STACK=1 -DESMF_NETCDF=1 -DESMF_YAMLCPP=1 -DESMF_YAML=1 -DESMF_NO_PTHREADS -DESMF_NO_OPENMP -DESMF_NO_OPENACC -DESMF_TESTEXHAUSTIVE -DESMF_BOPT_g -DESMF_TESTCOMPTUNNEL -DESMF_TESTWITHTHREADS -DSx86_64_small=1 -DESMF_OS_Darwin=1 -DESMF_COMM=mpiuni -DESMF_DIR=/project/esmf/himanshu/esmf_test/cronjobs/daily/gfortran_clang/esmf -DESMF_MPIUNI ESMF_MeshOpUTest.F90 -o ESMF_MeshOpUTest.o
gfortran    -m64 -mcmodel=small -L/project/esmf/himanshu/esmf_test/cronjobs/daily/gfortran_clang/esmf/lib/libg/Darwin.gfortranclang.64.mpiuni.default -L/project/esmf/GCC/Homebrew/9.3.0_1/netcdf/4.7.4/lib -L/project/esmf/GCC/Homebrew/9.3.0_1/netcdf/4.7.4/lib -Wl,-rpath,/project/esmf/himanshu/esmf_test/cronjobs/daily/gfortran_clang/esmf/lib/libg/Darwin.gfortranclang.64.mpiuni.default -Wl,-rpath,/project/esmf/GCC/Homebrew/9.3.0_1/netcdf/4.7.4/lib -Wl,-rpath,/project/esmf/GCC/Homebrew/9.3.0_1/netcdf/4.7.4/lib -o /project/esmf/himanshu/esmf_test/cronjobs/daily/gfortran_clang/esmf/test/testg/Darwin.gfortranclang.64.mpiuni.default/ESMF_MeshOpUTest   ESMF_MeshOpUTest.o -lesmf  -lstdc++ -lc++ -lnetcdf -lnetcdff
rm -rf -f *.o *.mod
gfortran -c -g -Wall -Wno-unused -Wno-unused-dummy-argument -fbacktrace -fbounds-check   -m64 -mcmodel=small -ffree-line-length-none  -I/project/esmf/himanshu/esmf_test/cronjobs/daily/gfortran_clang/esmf/build_config/Darwin.gfortranclang.default -I/project/esmf/himanshu/esmf_test/cronjobs/daily/gfortran_clang/esmf/src/Infrastructure -I/project/esmf/himanshu/esmf_test/cronjobs/daily/gfortran_clang/esmf/src/Superstructure -I/project/esmf/himanshu/esmf_test/cronjobs/daily/gfortran_clang/esmf/mod/modg/Darwin.gfortranclang.64.mpiuni.default -I/project/esmf/himanshu/esmf_test/cronjobs/daily/gfortran_clang/esmf/src/include -I/project/esmf/GCC/Homebrew/9.3.0_1/netcdf/4.7.4/include -I/project/esmf/GCC/Homebrew/9.3.0_1/netcdf/4.7.4/include  -DESMF_NO_INTEGER_1_BYTE -DESMF_NO_INTEGER_2_BYTE -DESMFVERSIONGIT='"ESMF_8_1_0_beta_snapshot_25-23-g5724188759"' -DESMF_MOAB=1 -DESMF_LAPACK=1 -DESMF_LAPACK_INTERNAL=1 -DESMF_NO_ACC_SOFTWARE_STACK=1 -DESMF_NETCDF=1 -DESMF_YAMLCPP=1 -DESMF_YAML=1 -DESMF_NO_PTHREADS -DESMF_NO_OPENMP -DESMF_NO_OPENACC -DESMF_TESTEXHAUSTIVE -DESMF_BOPT_g -DESMF_TESTCOMPTUNNEL -DESMF_TESTWITHTHREADS -DSx86_64_small=1 -DESMF_OS_Darwin=1 -DESMF_COMM=mpiuni -DESMF_DIR=/project/esmf/himanshu/esmf_test/cronjobs/daily/gfortran_clang/esmf -DESMF_MPIUNI ESMF_MeshUTest.F90 -o ESMF_MeshUTest.o
ESMF_MeshUTest.F90:31:0:

   31 |   use ESMF_TestMod     ! test methods
      | 
Fatal Error: error writing to /var/folders/q3/8nnhltcj6ws7wxttz_49xlzwwd2pp2/T//ccDlFxw4.s: No space left on device
compilation terminated.
make[5]: *** [ESMF_MeshUTest.o] Error 1
make[4]: *** [tree] Error 1
make[3]: *** [tree] Error 1
make[2]: *** [tree] Error 1
make[1]: *** [tree] Error 1
make: *** [build_unit_tests] Error 2

Sat Aug 15 19:35:40 MDT 2020 run_unit_tests_uni ...........PASS




The following unit test files failed to build, failed to execute or crashed during execution:

CRASHED: mpiuni/g: src/Infrastructure/Array/tests/ESMC_ArrayUTest.C
CRASHED: mpiuni/g: src/Infrastructure/Array/tests/ESMF_ArrayDataUTest.F90
CRASHED: mpiuni/g: src/Infrastructure/Array/tests/ESMF_ArraySMMFromFileUTest.F90
CRASHED: mpiuni/g: src/Infrastructure/Array/tests/ESMF_ArraySMMUTest.F90
CRASHED: mpiuni/g: src/Infrastructure/ArrayBundle/tests/ESMF_ArrayBundleCreateUTest.F90
CRASHED: mpiuni/g: src/Infrastructure/ArrayBundle/tests/ESMF_ArrayBundleRedistUTest.F90
CRASHED: mpiuni/g: src/Infrastructure/ArraySpec/tests/ESMC_ArraySpecUTest.C
CRASHED: mpiuni/g: src/Infrastructure/ArraySpec/tests/ESMF_ArraySpecUTest.F90
CRASHED: mpiuni/g: src/Infrastructure/Base/tests/ESMC_BaseUTest.C
CRASHED: mpiuni/g: src/Infrastructure/Base/tests/ESMC_InfoUTest.C
CRASHED: mpiuni/g: src/Infrastructure/Base/tests/ESMC_NlohmannJSONUTest.C
CRASHED: mpiuni/g: src/Infrastructure/Base/tests/ESMF_BaseUTest.F90
CRASHED: mpiuni/g: src/Infrastructure/Base/tests/ESMF_InfoArrayUTest.F90
CRASHED: mpiuni/g: src/Infrastructure/Base/tests/ESMF_InfoUTest.F90
CRASHED: mpiuni/g: src/Infrastructure/Config/tests/ESMC_ConfigUTest.C
CRASHED: mpiuni/g: src/Infrastructure/Config/tests/ESMF_ConfigUTest.F90
CRASHED: mpiuni/g: src/Infrastructure/Container/tests/ESMF_ContainerUTest.F90
CRASHED: mpiuni/g: src/Infrastructure/DELayout/tests/ESMF_DELayoutUTest.F90
CRASHED: mpiuni/g: src/Infrastructure/DELayout/tests/ESMF_DELayoutWorkQueueUTest.F90
CRASHED: mpiuni/g: src/Infrastructure/DistGrid/tests/ESMC_DistGridUTest.C
CRASHED: mpiuni/g: src/Infrastructure/DistGrid/tests/ESMF_DistGridCreateGetUTest.F90
CRASHED: mpiuni/g: src/Infrastructure/Field/tests/ESMC_FieldGridGridRegridCsrvUTest.C
CRASHED: mpiuni/g: src/Infrastructure/Field/tests/ESMC_FieldGridGridRegridUTest.C
CRASHED: mpiuni/g: src/Infrastructure/Field/tests/ESMC_FieldGridRegrid2UTest.C
CRASHED: mpiuni/g: src/Infrastructure/Field/tests/ESMC_FieldGridRegridCsrv2UTest.C
CRASHED: mpiuni/g: src/Infrastructure/Field/tests/ESMC_FieldGridRegridCsrvUTest.C
CRASHED: mpiuni/g: src/Infrastructure/Field/tests/ESMC_FieldGridRegridUTest.C
CRASHED: mpiuni/g: src/Infrastructure/Field/tests/ESMC_FieldRegridCsrvUTest.C
CRASHED: mpiuni/g: src/Infrastructure/Field/tests/ESMC_FieldRegridUTest.C
CRASHED: mpiuni/g: src/Infrastructure/Field/tests/ESMC_FieldSMMFromFileUTest.C
CRASHED: mpiuni/g: src/Infrastructure/Field/tests/ESMC_FieldUTest.C
CRASHED: mpiuni/g: src/Infrastructure/Field/tests/ESMF_FieldArbGridUTest.F90
CRASHED: mpiuni/g: src/Infrastructure/Field/tests/ESMF_FieldRedistArbUTest.F90
CRASHED: mpiuni/g: src/Infrastructure/Field/tests/ESMF_FieldRegridCSUTest.F90
CRASHED: mpiuni/g: src/Infrastructure/Field/tests/ESMF_FieldRegridCsrv2ndUTest.F90
CRASHED: mpiuni/g: src/Infrastructure/Field/tests/ESMF_FieldRegridCsrvUTest.F90
CRASHED: mpiuni/g: src/Infrastructure/Field/tests/ESMF_FieldRegridUTest.F90
CRASHED: mpiuni/g: src/Infrastructure/Field/tests/ESMF_FieldRegridXGUTest.F90
CRASHED: mpiuni/g: src/Infrastructure/Field/tests/ESMF_FieldSMMFromFileUTest.F90
CRASHED: mpiuni/g: src/Infrastructure/Field/tests/ESMF_FieldStressUTest.F90
CRASHED: mpiuni/g: src/Infrastructure/FieldBundle/tests/ESMF_FieldBundleRegridUTest.F90
CRASHED: mpiuni/g: src/Infrastructure/FieldBundle/tests/ESMF_FieldBundleUTest.F90
CRASHED: mpiuni/g: src/Infrastructure/Grid/tests/ESMC_GridUTest.C
CRASHED: mpiuni/g: src/Infrastructure/Grid/tests/ESMF_GridArbitraryUTest.F90
CRASHED: mpiuni/g: src/Infrastructure/Grid/tests/ESMF_GridCoordUTest.F90
CRASHED: mpiuni/g: src/Infrastructure/Grid/tests/ESMF_GridCreateUTest.F90
CRASHED: mpiuni/g: src/Infrastructure/Grid/tests/ESMF_GridItemUTest.F90
CRASHED: mpiuni/g: src/Infrastructure/IO/tests/ESMCI_IO_NetCDFUTest.C
CRASHED: mpiuni/g: src/Infrastructure/IO/tests/ESMCI_IO_PIOUTest.C
CRASHED: mpiuni/g: src/Infrastructure/IO/tests/ESMC_IO_InqUTest.C
CRASHED: mpiuni/g: src/Infrastructure/IO/tests/ESMF_IOUTest.F90
CRASHED: mpiuni/g: src/Infrastructure/IO/tests/ESMF_IO_PIOUTest.F90
CRASHED: mpiuni/g: src/Infrastructure/IO/tests/ESMF_IO_YAMLUTest.F90
CRASHED: mpiuni/g: src/Infrastructure/LocStream/tests/ESMC_LocStreamUTest.C
CRASHED: mpiuni/g: src/Infrastructure/LocStream/tests/ESMF_LocStreamUTest.F90
CRASHED: mpiuni/g: src/Infrastructure/LocalArray/tests/ESMF_LocalArrayDataUTest.F90
CRASHED: mpiuni/g: src/Infrastructure/LocalArray/tests/ESMF_LocalArrayUTest.F90
CRASHED: mpiuni/g: src/Infrastructure/LogErr/tests/ESMC_LogErrPerfUTest.C
CRASHED: mpiuni/g: src/Infrastructure/LogErr/tests/ESMC_LogErrUTest.C
CRASHED: mpiuni/g: src/Infrastructure/LogErr/tests/ESMF_LogErrPerfUTest.F90
CRASHED: mpiuni/g: src/Infrastructure/LogErr/tests/ESMF_LogErrUTest.F90
CRASHED: mpiuni/g: src/Infrastructure/Mesh/tests/ESMC_MBMesh_BilinearSingleElemUTest.C
CRASHED: mpiuni/g: src/Infrastructure/Mesh/tests/ESMC_MBMesh_BilinearUTest.C
CRASHED: mpiuni/g: src/Infrastructure/Mesh/tests/ESMC_MBMesh_CreateUTest.C
CRASHED: mpiuni/g: src/Infrastructure/Mesh/tests/ESMC_MBMesh_SearchUTest.C
CRASHED: mpiuni/g: src/Infrastructure/Mesh/tests/ESMC_MBMesh_SerializeUTest.C
CRASHED: mpiuni/g: src/Infrastructure/Mesh/tests/ESMC_MBMesh_UtilUTest.C
CRASHED: mpiuni/g: src/Infrastructure/Mesh/tests/ESMC_MeshMOABUTest.C
CRASHED: mpiuni/g: src/Infrastructure/Mesh/tests/ESMC_MeshUTest.C
CRASHED: mpiuni/g: src/Infrastructure/Mesh/tests/ESMC_Proj4UTest.C
CRASHED: mpiuni/g: src/Infrastructure/Mesh/tests/ESMF_MeshOpUTest.F90
CRASHED: mpiuni/g: src/Infrastructure/Mesh/tests/ESMF_MeshUTest.F90
CRASHED: mpiuni/g: src/Infrastructure/PointList/tests/ESMF_PointListUTest.F90
CRASHED: mpiuni/g: src/Infrastructure/Route/tests/ESMF_RouteHandleUTest.F90
CRASHED: mpiuni/g: src/Infrastructure/TimeMgr/tests/ESMC_CalendarUTest.C
CRASHED: mpiuni/g: src/Infrastructure/TimeMgr/tests/ESMC_ClockUTest.C
CRASHED: mpiuni/g: src/Infrastructure/TimeMgr/tests/ESMC_TimeIntervalUTest.C
CRASHED: mpiuni/g: src/Infrastructure/TimeMgr/tests/ESMC_TimeUTest.C
CRASHED: mpiuni/g: src/Infrastructure/TimeMgr/tests/ESMF_AlarmUTest.F90
CRASHED: mpiuni/g: src/Infrastructure/TimeMgr/tests/ESMF_CalRangeUTest.F90
CRASHED: mpiuni/g: src/Infrastructure/TimeMgr/tests/ESMF_CalendarUTest.F90
CRASHED: mpiuni/g: src/Infrastructure/TimeMgr/tests/ESMF_ClockUTest.F90
CRASHED: mpiuni/g: src/Infrastructure/TimeMgr/tests/ESMF_TimeIntervalUTest.F90
CRASHED: mpiuni/g: src/Infrastructure/TimeMgr/tests/ESMF_TimeUTest.F90
CRASHED: mpiuni/g: src/Infrastructure/Trace/tests/ESMC_TraceRegionUTest.C
CRASHED: mpiuni/g: src/Infrastructure/Trace/tests/ESMF_ProfileUTest.F90
CRASHED: mpiuni/g: src/Infrastructure/Trace/tests/ESMF_TraceClkMonoSyncUTest.F90
CRASHED: mpiuni/g: src/Infrastructure/Trace/tests/ESMF_TraceClkMonoUTest.F90
CRASHED: mpiuni/g: src/Infrastructure/Trace/tests/ESMF_TraceIOUTest.F90
CRASHED: mpiuni/g: src/Infrastructure/Trace/tests/ESMF_TraceMPIUTest.F90
CRASHED: mpiuni/g: src/Infrastructure/Trace/tests/ESMF_TraceUTest.F90
CRASHED: mpiuni/g: src/Infrastructure/Util/tests/ESMF_FortranWordsizeUTest.F90
CRASHED: mpiuni/g: src/Infrastructure/Util/tests/ESMF_InitMacrosUTest.F90
CRASHED: mpiuni/g: src/Infrastructure/Util/tests/ESMF_TypeKindGetUTest.F90
CRASHED: mpiuni/g: src/Infrastructure/Util/tests/ESMF_UtilUTest.F90
CRASHED: mpiuni/g: src/Infrastructure/VM/tests/ESMC_VMUTest.C
CRASHED: mpiuni/g: src/Infrastructure/VM/tests/ESMF_VMAccUTest.F90
CRASHED: mpiuni/g: src/Infrastructure/VM/tests/ESMF_VMAllGatherUTest.F90
CRASHED: mpiuni/g: src/Infrastructure/VM/tests/ESMF_VMAllGatherVUTest.F90
CRASHED: mpiuni/g: src/Infrastructure/VM/tests/ESMF_VMAllToAllUTest.F90
CRASHED: mpiuni/g: src/Infrastructure/VM/tests/ESMF_VMAllToAllVUTest.F90
CRASHED: mpiuni/g: src/Infrastructure/VM/tests/ESMF_VMBarrierUTest.F90
CRASHED: mpiuni/g: src/Infrastructure/VM/tests/ESMF_VMBroadcastUTest.F90
CRASHED: mpiuni/g: src/Infrastructure/VM/tests/ESMF_VMComponentUTest.F90
CRASHED: mpiuni/g: src/Infrastructure/VM/tests/ESMF_VMGatherUTest.F90
CRASHED: mpiuni/g: src/Infrastructure/VM/tests/ESMF_VMOpenMPUTest.F90
CRASHED: mpiuni/g: src/Infrastructure/VM/tests/ESMF_VMScatterUTest.F90
CRASHED: mpiuni/g: src/Infrastructure/VM/tests/ESMF_VMSendNbVMRecvNbUTest.F90
CRASHED: mpiuni/g: src/Infrastructure/VM/tests/ESMF_VMSendRecvNbUTest.F90
CRASHED: mpiuni/g: src/Infrastructure/VM/tests/ESMF_VMSendRecvUTest.F90
CRASHED: mpiuni/g: src/Infrastructure/VM/tests/ESMF_VMUTest.F90
CRASHED: mpiuni/g: src/Infrastructure/VM/tests/ESMF_VMUserMpiInitUTest.F90
CRASHED: mpiuni/g: src/Infrastructure/XGrid/tests/ESMC_XGridUTest.C
CRASHED: mpiuni/g: src/Infrastructure/XGrid/tests/ESMF_XGridMaskingUTest.F90
CRASHED: mpiuni/g: src/Infrastructure/XGrid/tests/ESMF_XGridUTest.F90
CRASHED: mpiuni/g: src/Superstructure/AttributeAPI/tests/ESMF_AttributeUtilUTest.F90
CRASHED: mpiuni/g: src/Superstructure/Component/tests/ESMC_ComponentUTest.C
CRASHED: mpiuni/g: src/Superstructure/Component/tests/ESMF_CompSetServUTest.F90
CRASHED: mpiuni/g: src/Superstructure/Component/tests/ESMF_ComponentUTest.F90
CRASHED: mpiuni/g: src/Superstructure/Component/tests/ESMF_CplCompCreateUTest.F90
CRASHED: mpiuni/g: src/Superstructure/Component/tests/ESMF_GridCompCreateUTest.F90
CRASHED: mpiuni/g: src/Superstructure/Component/tests/ESMF_SciCompCreateUTest.F90
CRASHED: mpiuni/g: src/Superstructure/Component/tests/ESMF_StdCompMethodsUTest.F90
CRASHED: mpiuni/g: src/Superstructure/ESMFMod/tests/ESMF_FrameworkUTest.F90
CRASHED: mpiuni/g: src/Superstructure/IOAPI/tests/ESMF_IOCompUTest.F90
CRASHED: mpiuni/g: src/Superstructure/InfoAPI/tests/ESMF_InfoDescribeUTest.F90
CRASHED: mpiuni/g: src/Superstructure/InfoAPI/tests/ESMF_InfoGetInterfaceArrayUTest.F90
CRASHED: mpiuni/g: src/Superstructure/InfoAPI/tests/ESMF_InfoSyncUTest.F90
CRASHED: mpiuni/g: src/Superstructure/PreESMFMod/tests/ESMF_FileRegridUTest.F90
CRASHED: mpiuni/g: src/Superstructure/PreESMFMod/tests/ESMF_RegridWeightGenUTest.F90
CRASHED: mpiuni/g: src/Superstructure/State/tests/ESMC_StateUTest.C
CRASHED: mpiuni/g: src/Superstructure/State/tests/ESMF_StateCreateUTest.F90
CRASHED: mpiuni/g: src/Superstructure/State/tests/ESMF_StateReadWriteUTest.F90
CRASHED: mpiuni/g: src/Superstructure/State/tests/ESMF_StateUTest.F90
CRASHED: mpiuni/g: src/addon/NUOPC/tests/ESMF_NUOPC_UTest.F90
CRASHED: mpiuni/g: src/epilogue/tests/ESMCI_TestUTest.C
CRASHED: mpiuni/g: src/epilogue/tests/ESMC_TestUTest.C
CRASHED: mpiuni/g: src/epilogue/tests/ESMF_TestUTest.F90
CRASHED: mpiuni/g: src/prologue/tests/ESMCI_ExceptionsUTest.C
CRASHED: mpiuni/g: src/prologue/tests/ESMCI_FeatureUTest.C
CRASHED: mpiuni/g: src/prologue/tests/ESMF_F90ArrayPtrUTest.F90
CRASHED: mpiuni/g: src/prologue/tests/ESMF_FeatureUTest.F90
CRASHED: mpiuni/g: src/prologue/tests/ESMF_LAPACKUTest.F90
CRASHED: mpiuni/g: src/prologue/tests/ESMF_StringUTest.F90
CRASHED: mpiuni/g: src/prologue/tests/ESMF_WordsizeUTest.F90


The following test harness unit tests fail, did not build, or did not execute:
FAIL: mpiuni/g: ESMF_array_default_NP1UTest
FAIL: mpiuni/g: ESMF_field_default_NP1UTest


The log and stdout files for the unit tests can be found at:
/project/esmf/himanshu/esmf_test/cronjobs/daily/gfortran_clang/esmf/test/testg/Darwin.gfortranclang.64.mpiuni.default


Found 4674 exhaustive single processor unit tests, 0 passed and 4674 failed.



_______________________________________________________________________________________________

Sat Aug 15 19:36:34 MDT 2020 on cgdm-catania 

ESMF Checkout Source: https://github.com/esmf-org/esmf.git

Compiler and configuration information:

-------------------------------------------------------------- 
Currently Loaded Modulefiles:
 1) GCC/Homebrew/9.3.0_1/gcc   2) GCC/Homebrew/9.3.0_1/netcdf/4.7.4s  

Repository:
origin	https://github.com/esmf-org/esmf.git (fetch)
origin	https://github.com/esmf-org/esmf.git (push)
 
ESMF_8_1_0_beta_snapshot_25-23-g5724188759
 
 
 
--------------------------------------------------------------
ESMF_VERSION_STRING:    8.1.0 beta snapshot
ESMF_8_1_0_beta_snapshot_25-23-g5724188759
--------------------------------------------------------------
On branch develop
Your branch is up to date with 'origin/develop'.

Untracked files:
  (use "git add ..." to include in what will be committed)

	src/installcheck/esmc_application
	src/installcheck/esmc_application.o
	src/installcheck/esmf_application
	src/installcheck/esmf_application.o
	tmp

nothing added to commit but untracked files present (use "git add" to track)
--------------------------------------------------------------
 
--------------------------------------------------------------
Make version:
GNU Make 3.81
Copyright (C) 2006  Free Software Foundation, Inc.
This is free software; see the source for copying conditions.
There is NO warranty; not even for MERCHANTABILITY or FITNESS FOR A
PARTICULAR PURPOSE.

This program built for i386-apple-darwin11.3.0

--------------------------------------------------------------
Fortran Compiler version:
GNU Fortran (Homebrew GCC 10.1.0) 10.1.0
Copyright (C) 2020 Free Software Foundation, Inc.
This is free software; see the source for copying conditions.  There is NO
warranty; not even for MERCHANTABILITY or FITNESS FOR A PARTICULAR PURPOSE.


--------------------------------------------------------------
C++ Compiler version:
Apple LLVM version 10.0.1 (clang-1001.0.46.4)
Target: x86_64-apple-darwin18.7.0
Thread model: posix
InstalledDir: /Library/Developer/CommandLineTools/usr/bin

--------------------------------------------------------------
Preprocessor version:
Apple LLVM version 10.0.1 (clang-1001.0.46.4)
Target: x86_64-apple-darwin18.7.0
Thread model: posix
InstalledDir: /Library/Developer/CommandLineTools/usr/bin
--------------------------------------------------------------
NetCDF library version: netCDF 4.7.4
NetCDF Fortran version: netCDF-Fortran 4.5.3
 
--------------------------------------------------------------
 * User set ESMF environment variables *
ESMF_ABI=64
ESMF_BOPT=O
ESMF_COMM=mpiuni
ESMF_COMPILER=gfortranclang
ESMF_DIR=/project/esmf/himanshu/esmf_test/cronjobs/daily/gfortran_clang/esmf
ESMF_INSTALL_PREFIX=/project/esmf/himanshu/esmf_test/cronjobs/daily/gfortran_clang/install_dir
ESMF_NETCDF=nc-config
ESMF_OS=Darwin
ESMF_SITE=default
ESMF_TESTEXHAUSTIVE=ON
ESMF_TESTMPMD=OFF
ESMF_TESTWITHTHREADS=ON
 
--------------------------------------------------------------
 * ESMF environment variables *
ESMF_DIR: /project/esmf/himanshu/esmf_test/cronjobs/daily/gfortran_clang/esmf
ESMF_OS:                Darwin
ESMF_MACHINE:           x86_64
ESMF_ABI:               64
ESMF_COMPILER:          gfortranclang
ESMF_BOPT:              O
ESMF_COMM:              mpiuni
ESMF_SITE:              default
ESMF_PTHREADS:          OFF
ESMF_OPENMP:            OFF
ESMF_OPENACC:           OFF
ESMF_CXXSTD:            11
ESMF_ARRAY_LITE:        FALSE
ESMF_NO_INTEGER_1_BYTE: TRUE
ESMF_NO_INTEGER_2_BYTE: TRUE
ESMF_FORTRANSYMBOLS:    default
ESMF_MAPPER_BUILD:      OFF
ESMF_AUTO_LIB_BUILD:    ON
ESMF_DEFER_LIB_BUILD:   ON
ESMF_SHARED_LIB_BUILD:  ON
ESMF_TRACE_LIB_BUILD:   ON
ESMF_TESTEXHAUSTIVE:    ON
ESMF_TESTCOMPTUNNEL:    ON
ESMF_TESTWITHTHREADS:   ON
ESMF_TESTMPMD:          OFF
ESMF_TESTSHAREDOBJ:     OFF
ESMF_TESTFORCEOPENMP:   OFF
ESMF_TESTFORCEOPENACC:  OFF
ESMF_TESTHARNESS_ARRAY: default
ESMF_TESTHARNESS_FIELD: default
ESMF_MPIRUN:            /project/esmf/himanshu/esmf_test/cronjobs/daily/gfortran_clang/esmf/src/Infrastructure/stubs/mpiuni/mpirun
 
--------------------------------------------------------------
 * ESMF environment variables pointing to 3rd party software *
ESMF_MOAB:               internal
ESMF_LAPACK:             internal
ESMF_ACC_SOFTWARE_STACK: none
ESMF_NETCDF:             nc-config
ESMF_NETCDF_INCLUDE:     /project/esmf/GCC/Homebrew/9.3.0_1/netcdf/4.7.4/include
ESMF_NETCDF_LIBS:        -lnetcdf
ESMF_NETCDF_LIBPATH:     /project/esmf/GCC/Homebrew/9.3.0_1/netcdf/4.7.4/lib
ESMF_NFCONFIG:           nf-config
ESMF_NETCDFF_INCLUDE:    /project/esmf/GCC/Homebrew/9.3.0_1/netcdf/4.7.4/include
ESMF_NETCDFF_LIBS:       -lnetcdff
ESMF_NETCDFF_LIBPATH:    /project/esmf/GCC/Homebrew/9.3.0_1/netcdf/4.7.4/lib
ESMF_YAMLCPP:            internal
 
--------------------------------------------------------------
 * ESMF environment variables for final installation *
ESMF_INSTALL_PREFIX:    /project/esmf/himanshu/esmf_test/cronjobs/daily/gfortran_clang/install_dir
ESMF_INSTALL_HEADERDIR: include
ESMF_INSTALL_MODDIR:    mod/modO/Darwin.gfortranclang.64.mpiuni.default
ESMF_INSTALL_LIBDIR:    lib/libO/Darwin.gfortranclang.64.mpiuni.default
ESMF_INSTALL_BINDIR:    bin/binO/Darwin.gfortranclang.64.mpiuni.default
ESMF_INSTALL_DOCDIR:    doc
 
--------------------------------------------------------------
 * ESMF Benchmark directory and parameters *
ESMF_BENCHMARK_PREFIX:         ./DEFAULTBENCHMARKDIR
ESMF_BENCHMARK_TOLERANCE:      20%
ESMF_BENCHMARK_THRESHOLD_MSEC: 500
 
--------------------------------------------------------------
 * Other relevant environment variables *
PATH:    /project/esmf/GCC/Homebrew/9.3.0_1/netcdf/4.7.4/bin:/project/esmf/GCC/Homebrew/9.3.0_1:/project/esmf/Modules/bin:/home/himanshu/bin:/usr/local/bin:/usr/bin:/bin:/usr/sbin:/sbin:/opt/local/bin:/opt/local/sbin:/opt/X11/bin
LD_LIBRARY_PATH: 
 
--------------------------------------------------------------
 * Compilers, Linkers, Flags, and Libraries *
Location of the preprocessor:      /usr/bin/clang
Location of the Fortran compiler:  /usr/local/bin/gfortran
Location of the Fortran linker:    /usr/local/bin/gfortran
Location of the C++ compiler:      /usr/bin/clang
Location of the C++ linker:        /usr/bin/clang

Fortran compiler flags:
ESMF_F90COMPILER: gfortran
ESMF_F90COMPILEOPTS: -O   -m64 -mcmodel=small -ffree-line-length-none
ESMF_F90COMPILEPATHS: -I/project/esmf/himanshu/esmf_test/cronjobs/daily/gfortran_clang/esmf/mod/modO/Darwin.gfortranclang.64.mpiuni.default -I/project/esmf/himanshu/esmf_test/cronjobs/daily/gfortran_clang/esmf/src/include -I/project/esmf/GCC/Homebrew/9.3.0_1/netcdf/4.7.4/include -I/project/esmf/GCC/Homebrew/9.3.0_1/netcdf/4.7.4/include
ESMF_F90COMPILECPPFLAGS: -DESMF_NO_INTEGER_1_BYTE -DESMF_NO_INTEGER_2_BYTE -DESMFVERSIONGIT='ESMF_8_1_0_beta_snapshot_25-23-g5724188759' -DESMF_MOAB=1 -DESMF_LAPACK=1 -DESMF_LAPACK_INTERNAL=1 -DESMF_NO_ACC_SOFTWARE_STACK=1 -DESMF_NETCDF=1 -DESMF_YAMLCPP=1 -DESMF_YAML=1 -DESMF_NO_PTHREADS -DESMF_NO_OPENMP -DESMF_NO_OPENACC -DESMF_TESTEXHAUSTIVE -DESMF_BOPT_O -DESMF_TESTCOMPTUNNEL -DESMF_TESTWITHTHREADS -DSx86_64_small=1 -DESMF_OS_Darwin=1 -DESMF_COMM=mpiuni -DESMF_DIR=/project/esmf/himanshu/esmf_test/cronjobs/daily/gfortran_clang/esmf -DESMF_MPIUNI
ESMF_F90COMPILEFREECPP: 
ESMF_F90COMPILEFREENOCPP: -ffree-form
ESMF_F90COMPILEFIXCPP: -cpp -ffixed-form
ESMF_F90COMPILEFIXNOCPP: 

Fortran linker flags:
ESMF_F90LINKOPTS:    -m64 -mcmodel=small
ESMF_F90LINKPATHS: -L/project/esmf/himanshu/esmf_test/cronjobs/daily/gfortran_clang/esmf/lib/libO/Darwin.gfortranclang.64.mpiuni.default -L/project/esmf/GCC/Homebrew/9.3.0_1/netcdf/4.7.4/lib -L/project/esmf/GCC/Homebrew/9.3.0_1/netcdf/4.7.4/lib
ESMF_F90LINKRPATHS: -Wl,-rpath,/project/esmf/himanshu/esmf_test/cronjobs/daily/gfortran_clang/esmf/lib/libO/Darwin.gfortranclang.64.mpiuni.default -Wl,-rpath,/project/esmf/GCC/Homebrew/9.3.0_1/netcdf/4.7.4/lib -Wl,-rpath,/project/esmf/GCC/Homebrew/9.3.0_1/netcdf/4.7.4/lib
ESMF_F90LINKLIBS:  -lstdc++ -lc++ -lnetcdf -lnetcdff
ESMF_F90ESMFLINKLIBS: -lesmf  -lstdc++ -lc++ -lnetcdf -lnetcdff

C++ compiler flags:
ESMF_CXXCOMPILER: clang
ESMF_CXXCOMPILEOPTS: -std=c++11 -O -DNDEBUG  -DESMF_LOWERCASE_SINGLEUNDERSCORE -m64 -mcmodel=small
ESMF_CXXCOMPILEPATHS:  -I/project/esmf/himanshu/esmf_test/cronjobs/daily/gfortran_clang/esmf/src/include  -I/project/esmf/GCC/Homebrew/9.3.0_1/netcdf/4.7.4/include -I/project/esmf/himanshu/esmf_test/cronjobs/daily/gfortran_clang/esmf/src/Infrastructure/stubs/mpiuni -I/project/esmf/himanshu/esmf_test/cronjobs/daily/gfortran_clang/esmf/src/prologue/yaml-cpp/include
ESMF_CXXCOMPILECPPFLAGS: -DESMF_NO_INTEGER_1_BYTE -DESMF_NO_INTEGER_2_BYTE -DESMFVERSIONGIT='ESMF_8_1_0_beta_snapshot_25-23-g5724188759' -DESMF_MOAB=1 -DESMF_LAPACK=1 -DESMF_LAPACK_INTERNAL=1 -DESMF_NO_ACC_SOFTWARE_STACK=1 -DESMF_NETCDF=1 -DESMF_YAMLCPP=1 -DESMF_YAML=1 -DESMF_NO_PTHREADS -DESMF_NO_OPENMP -DESMF_NO_OPENACC -DESMF_TESTEXHAUSTIVE -DESMF_BOPT_O -DESMF_TESTCOMPTUNNEL -DESMF_TESTWITHTHREADS -DSx86_64_small=1 -DESMF_OS_Darwin=1 -DESMF_COMM=mpiuni -DESMF_DIR=/project/esmf/himanshu/esmf_test/cronjobs/daily/gfortran_clang/esmf -D__SDIR__='' -DESMF_CXXSTD=11 -x c++ -DESMF_MPIUNI

C++ linker flags:
ESMF_CXXLINKOPTS:   -m64 -mcmodel=small
ESMF_CXXLINKPATHS: -L/project/esmf/himanshu/esmf_test/cronjobs/daily/gfortran_clang/esmf/lib/libO/Darwin.gfortranclang.64.mpiuni.default -L/project/esmf/GCC/Homebrew/9.3.0_1/netcdf/4.7.4/lib -L/project/esmf/GCC/Homebrew/9.3.0_1/netcdf/4.7.4/lib -L/usr/local/Cellar/gcc/10.1.0/lib/gcc/10/gcc/x86_64-apple-darwin18/10.1.0/../../../
ESMF_CXXLINKRPATHS: -Wl,-rpath,/project/esmf/himanshu/esmf_test/cronjobs/daily/gfortran_clang/esmf/lib/libO/Darwin.gfortranclang.64.mpiuni.default -Wl,-rpath,/project/esmf/GCC/Homebrew/9.3.0_1/netcdf/4.7.4/lib -Wl,-rpath,/project/esmf/GCC/Homebrew/9.3.0_1/netcdf/4.7.4/lib -Wl,-rpath,/usr/local/Cellar/gcc/10.1.0/lib/gcc/10/gcc/x86_64-apple-darwin18/10.1.0/../../../
ESMF_CXXLINKLIBS:  -lgfortran -lstdc++ -lc++ -lnetcdf -lnetcdff
ESMF_CXXESMFLINKLIBS: -lesmf  -lgfortran -lstdc++ -lc++ -lnetcdf -lnetcdff

Shared library build:
ESMF_SL_LIBS_TO_MAKE: libesmf
ESMF_SL_SUFFIX:       dylib
ESMF_SL_LIBLINKER:    clang
ESMF_SL_LIBOPTS:       -dynamiclib
ESMF_SL_LIBLIBS:       -L/project/esmf/himanshu/esmf_test/cronjobs/daily/gfortran_clang/esmf/lib/libO/Darwin.gfortranclang.64.mpiuni.default -L/project/esmf/GCC/Homebrew/9.3.0_1/netcdf/4.7.4/lib -L/project/esmf/GCC/Homebrew/9.3.0_1/netcdf/4.7.4/lib  -lstdc++ -lc++ -lnetcdf -lnetcdff -L/project/esmf/himanshu/esmf_test/cronjobs/daily/gfortran_clang/esmf/lib/libO/Darwin.gfortranclang.64.mpiuni.default -L/project/esmf/GCC/Homebrew/9.3.0_1/netcdf/4.7.4/lib -L/project/esmf/GCC/Homebrew/9.3.0_1/netcdf/4.7.4/lib -L/usr/local/Cellar/gcc/10.1.0/lib/gcc/10/gcc/x86_64-apple-darwin18/10.1.0/../../../  -lgfortran -lstdc++ -lc++ -lnetcdf -lnetcdff

ESMF Tracing linker options:
ESMF_TRACE_LDPRELOAD=/project/esmf/himanshu/esmf_test/cronjobs/daily/gfortran_clang/esmf/lib/libO/Darwin.gfortranclang.64.mpiuni.default/libesmftrace_preload.dylib
ESMF_TRACE_STATICLINKOPTS=-static -Wl,--wrap=c_esmftrace_notify_wrappers -Wl,--wrap=c_esmftrace_isinitialized -Wl,--wrap=write -Wl,--wrap=writev -Wl,--wrap=pwrite -Wl,--wrap=read -Wl,--wrap=open -Wl,--wrap=MPI_Allgather -Wl,--wrap=MPI_Allgatherv -Wl,--wrap=MPI_Allreduce -Wl,--wrap=MPI_Alltoall -Wl,--wrap=MPI_Alltoallv -Wl,--wrap=MPI_Alltoallw -Wl,--wrap=MPI_Barrier -Wl,--wrap=MPI_Bcast -Wl,--wrap=MPI_Gather -Wl,--wrap=MPI_Gatherv -Wl,--wrap=MPI_Recv -Wl,--wrap=MPI_Reduce -Wl,--wrap=MPI_Scatter -Wl,--wrap=MPI_Send -Wl,--wrap=MPI_Sendrecv -Wl,--wrap=MPI_Wait -Wl,--wrap=MPI_Waitall -Wl,--wrap=MPI_Waitany -Wl,--wrap=MPI_Waitsome -Wl,--wrap=mpi_allgather_ -Wl,--wrap=mpi_allgather__ -Wl,--wrap=mpi_allgatherv_ -Wl,--wrap=mpi_allgatherv__ -Wl,--wrap=mpi_allreduce_ -Wl,--wrap=mpi_allreduce__ -Wl,--wrap=mpi_alltoall_ -Wl,--wrap=mpi_alltoall__ -Wl,--wrap=mpi_alltoallv_ -Wl,--wrap=mpi_alltoallv__ -Wl,--wrap=mpi_alltoallw_ -Wl,--wrap=mpi_alltoallw__ -Wl,--wrap=mpi_barrier_ -Wl,--wrap=mpi_barrier__ -Wl,--wrap=mpi_bcast_ -Wl,--wrap=mpi_bcast__ -Wl,--wrap=mpi_exscan_ -Wl,--wrap=mpi_exscan__ -Wl,--wrap=mpi_gather_ -Wl,--wrap=mpi_gather__ -Wl,--wrap=mpi_gatherv_ -Wl,--wrap=mpi_gatherv__ -Wl,--wrap=mpi_recv_ -Wl,--wrap=mpi_recv__ -Wl,--wrap=mpi_reduce_ -Wl,--wrap=mpi_reduce__ -Wl,--wrap=mpi_reduce_scatter_ -Wl,--wrap=mpi_reduce_scatter__ -Wl,--wrap=mpi_scatter_ -Wl,--wrap=mpi_scatter__ -Wl,--wrap=mpi_scatterv_ -Wl,--wrap=mpi_scatterv__ -Wl,--wrap=mpi_scan_ -Wl,--wrap=mpi_scan__ -Wl,--wrap=mpi_send_ -Wl,--wrap=mpi_send__ -Wl,--wrap=mpi_wait_ -Wl,--wrap=mpi_wait__ -Wl,--wrap=mpi_waitall_ -Wl,--wrap=mpi_waitall__ -Wl,--wrap=mpi_waitany_ -Wl,--wrap=mpi_waitany__
ESMF_TRACE_STATICLINKLIBS=-lesmftrace_static


--------------------------------------------------------------
Compiling on Sat Aug 15 19:36:35 MDT 2020 on cgdm-catania
Machine characteristics: Darwin cgdm-catania 18.7.0 Darwin Kernel Version 18.7.0: Tue Aug 20 16:57:14 PDT 2019; root:xnu-4903.271.2~2/RELEASE_X86_64 x86_64
==============================================================
 
Sat Aug 15 19:52:23 MDT 2020 library build ................PASS
Builds with warnings.
Sat Aug 15 19:52:38 MDT 2020 library install ..............PASS
Sat Aug 15 19:52:39 MDT 2020 library installcheck .........PASS
Sat Aug 15 19:53:54 MDT 2020 quickstart build .............PASS

|------------------------ APPs TESTS --------------------------|
Sat Aug 15 19:54:00 MDT 2020 apps build ...................PASS

|--------------------------------------------------------------|
Sat Aug 15 19:54:00 MDT 2020 ESMF_Regrid --help ***********FAIL
The following is the output of ESMF_Regrid --help

dyld: Library not loaded: /usr/local/opt/gcc/lib/gcc/9/libgfortran.5.dylib
  Referenced from: /project/esmf/GCC/Homebrew/9.3.0_1/netcdf/4.7.4/lib/libnetcdff.7.dylib
  Reason: image not found



|--------------------------------------------------------------|
Sat Aug 15 19:54:00 MDT 2020 ESMF_Regrid --version ********FAIL
The following is the output of ESMF_Regrid --version

dyld: Library not loaded: /usr/local/opt/gcc/lib/gcc/9/libgfortran.5.dylib
  Referenced from: /project/esmf/GCC/Homebrew/9.3.0_1/netcdf/4.7.4/lib/libnetcdff.7.dylib
  Reason: image not found



|--------------------------------------------------------------|
Sat Aug 15 19:54:00 MDT 2020 ESMF_Regrid -V ***************FAIL
The following is the output of ESMF_Regrid -V

dyld: Library not loaded: /usr/local/opt/gcc/lib/gcc/9/libgfortran.5.dylib
  Referenced from: /project/esmf/GCC/Homebrew/9.3.0_1/netcdf/4.7.4/lib/libnetcdff.7.dylib
  Reason: image not found



|--------------------------------------------------------------|
Sat Aug 15 19:54:00 MDT 2020 ESMF_Info --help *************FAIL
The following is the output of ESMF_Info --help 

dyld: Library not loaded: /usr/local/opt/gcc/lib/gcc/9/libgfortran.5.dylib
  Referenced from: /project/esmf/GCC/Homebrew/9.3.0_1/netcdf/4.7.4/lib/libnetcdff.7.dylib
  Reason: image not found



|--------------------------------------------------------------|
Sat Aug 15 19:54:01 MDT 2020 ESMF_Info --version **********FAIL
The following is the output of ESMF_Info --version 

dyld: Library not loaded: /usr/local/opt/gcc/lib/gcc/9/libgfortran.5.dylib
  Referenced from: /project/esmf/GCC/Homebrew/9.3.0_1/netcdf/4.7.4/lib/libnetcdff.7.dylib
  Reason: image not found



|--------------------------------------------------------------|
Sat Aug 15 19:54:01 MDT 2020 ESMF_Info -V *****************FAIL
The following is the output of ESMF_Info -V 

dyld: Library not loaded: /usr/local/opt/gcc/lib/gcc/9/libgfortran.5.dylib
  Referenced from: /project/esmf/GCC/Homebrew/9.3.0_1/netcdf/4.7.4/lib/libnetcdff.7.dylib
  Reason: image not found



|--------------------------------------------------------------|
Sat Aug 15 19:54:01 MDT 2020 ESMF_InfoC --help ************FAIL
The following is the output of ESMF_InfoC --help

dyld: Library not loaded: /usr/local/opt/gcc/lib/gcc/9/libgfortran.5.dylib
  Referenced from: /project/esmf/GCC/Homebrew/9.3.0_1/netcdf/4.7.4/lib/libnetcdff.7.dylib
  Reason: image not found



|--------------------------------------------------------------|
Sat Aug 15 19:54:01 MDT 2020 ESMF_InfoC --version *********FAIL
The following is the output of ESMF_InfoC --version

dyld: Library not loaded: /usr/local/opt/gcc/lib/gcc/9/libgfortran.5.dylib
  Referenced from: /project/esmf/GCC/Homebrew/9.3.0_1/netcdf/4.7.4/lib/libnetcdff.7.dylib
  Reason: image not found



|--------------------------------------------------------------|
Sat Aug 15 19:54:01 MDT 2020 ESMF_InfoC -V ****************FAIL
The following is the output of ESMF_InfoC -V

dyld: Library not loaded: /usr/local/opt/gcc/lib/gcc/9/libgfortran.5.dylib
  Referenced from: /project/esmf/GCC/Homebrew/9.3.0_1/netcdf/4.7.4/lib/libnetcdff.7.dylib
  Reason: image not found



|--------------------------------------------------------------|
Sat Aug 15 19:54:01 MDT 2020 ESMF_RegridWeightGen --help **FAIL
The following is the output of ESMF_RegridWeightGen --help

dyld: Library not loaded: /usr/local/opt/gcc/lib/gcc/9/libgfortran.5.dylib
  Referenced from: /project/esmf/GCC/Homebrew/9.3.0_1/netcdf/4.7.4/lib/libnetcdff.7.dylib
  Reason: image not found



|--------------------------------------------------------------|
Sat Aug 15 19:54:01 MDT 2020 ESMF_RegridWeightGen --version FAIL
The following is the output of ESMF_RegridWeightGen --version

dyld: Library not loaded: /usr/local/opt/gcc/lib/gcc/9/libgfortran.5.dylib
  Referenced from: /project/esmf/GCC/Homebrew/9.3.0_1/netcdf/4.7.4/lib/libnetcdff.7.dylib
  Reason: image not found



|--------------------------------------------------------------|
Sat Aug 15 19:54:01 MDT 2020 ESMF_RegridWeightGen -V ******FAIL
The following is the output of ESMF_RegridWeightGen -V

dyld: Library not loaded: /usr/local/opt/gcc/lib/gcc/9/libgfortran.5.dylib
  Referenced from: /project/esmf/GCC/Homebrew/9.3.0_1/netcdf/4.7.4/lib/libnetcdff.7.dylib
  Reason: image not found



|--------------------------------------------------------------|
Sat Aug 15 19:54:01 MDT 2020 ESMF_Scrip2Unstruct --help ***FAIL
The following is the output of ESMF_Scrip2Unstruct --help

dyld: Library not loaded: /usr/local/opt/gcc/lib/gcc/9/libgfortran.5.dylib
  Referenced from: /project/esmf/GCC/Homebrew/9.3.0_1/netcdf/4.7.4/lib/libnetcdff.7.dylib
  Reason: image not found



|--------------------------------------------------------------|
Sat Aug 15 19:54:01 MDT 2020 ESMF_Scrip2Unstruct --version FAIL
The following is the output of ESMF_Scrip2Unstruct --version

dyld: Library not loaded: /usr/local/opt/gcc/lib/gcc/9/libgfortran.5.dylib
  Referenced from: /project/esmf/GCC/Homebrew/9.3.0_1/netcdf/4.7.4/lib/libnetcdff.7.dylib
  Reason: image not found



|--------------------------------------------------------------|
Sat Aug 15 19:54:01 MDT 2020 ESMF_Scrip2Unstruct -V *******FAIL
The following is the output of ESMF_Scrip2Unstruct -V

dyld: Library not loaded: /usr/local/opt/gcc/lib/gcc/9/libgfortran.5.dylib
  Referenced from: /project/esmf/GCC/Homebrew/9.3.0_1/netcdf/4.7.4/lib/libnetcdff.7.dylib
  Reason: image not found



|--------------------------------------------------------------|
Sat Aug 15 19:54:01 MDT 2020 ESMF_WebServController --help FAIL
The following is the output of ESMF_WebServController --help

dyld: Library not loaded: /usr/local/opt/gcc/lib/gcc/9/libgfortran.5.dylib
  Referenced from: /project/esmf/GCC/Homebrew/9.3.0_1/netcdf/4.7.4/lib/libnetcdff.7.dylib
  Reason: image not found



|--------------------------------------------------------------|
Sat Aug 15 19:54:01 MDT 2020 ESMF_WebServController --version FAIL
The following is the output of ESMF_WebServController --version

dyld: Library not loaded: /usr/local/opt/gcc/lib/gcc/9/libgfortran.5.dylib
  Referenced from: /project/esmf/GCC/Homebrew/9.3.0_1/netcdf/4.7.4/lib/libnetcdff.7.dylib
  Reason: image not found



|--------------------------------------------------------------|
Sat Aug 15 19:54:01 MDT 2020 ESMF_WebServController -V ****FAIL
The following is the output of ESMF_WebServController -V

dyld: Library not loaded: /usr/local/opt/gcc/lib/gcc/9/libgfortran.5.dylib
  Referenced from: /project/esmf/GCC/Homebrew/9.3.0_1/netcdf/4.7.4/lib/libnetcdff.7.dylib
  Reason: image not found




Ran 18 applications tests, 0 passed and 18 failed.

|----------------------- SYSTEM TESTS -------------------------|
Sat Aug 15 19:58:57 MDT 2020 build_system_tests ...........PASS
Sat Aug 15 19:59:18 MDT 2020 run_system_tests_uni .........PASS
The following system tests failed, did not build, or did not execute:


FAIL: mpiuni/O: src/system_tests/ESMF_ArraySharedDeSSI/ESMF_ArraySharedDeSSISTest.F90
FAIL: mpiuni/O: src/system_tests/ESMF_CompCreate/ESMF_CompCreateSTest.F90
FAIL: mpiuni/O: src/system_tests/ESMF_CompFortranAndC/ESMF_CompFortranAndCSTest.F90
FAIL: mpiuni/O: src/system_tests/ESMF_FieldBundleRedistArb2Arb/ESMF_FieldBundleRedistArb2ArbSTest.F90
FAIL: mpiuni/O: src/system_tests/ESMF_FieldBundleRedistBlk2Arb/ESMF_FieldBundleRedistBlk2ArbSTest.F90
FAIL: mpiuni/O: src/system_tests/ESMF_FieldRedistArb2Arb/ESMF_FieldRedistArb2ArbSTest.F90
FAIL: mpiuni/O: src/system_tests/ESMF_XGridSerial/ESMF_XGridSerialSTest.F90


NOTE: There are no executable system test files, either the 'gmake ESMF_BOPT=O build_system_tests' has 
not been run or the 'gmake ESMF_BOPT=O' did not build successfully. 



The stdout files for the system_tests can be found at:
/project/esmf/himanshu/esmf_test/cronjobs/daily/gfortran_clang/esmf/test/testO/Darwin.gfortranclang.64.mpiuni.default


Found 7 single processor system tests, 0 passed and 7 failed.



|------------------------- EXAMPLES ---------------------------|
Sat Aug 15 20:03:02 MDT 2020 build_examples ...............PASS
Sat Aug 15 20:04:31 MDT 2020 run_examples_uni .............PASS
The following examples failed, did not build, or did not execute:


FAIL: mpiuni/O: src/Infrastructure/ArraySpec/examples/ESMF_ArraySpecEx.F90
FAIL: mpiuni/O: src/Infrastructure/Config/examples/ESMF_ConfigOverviewEx.F90
FAIL: mpiuni/O: src/Infrastructure/DELayout/examples/ESMF_DELayoutEx.F90
FAIL: mpiuni/O: src/Infrastructure/Field/examples/ESMF_FieldArbGridEx.F90
FAIL: mpiuni/O: src/Infrastructure/FieldBundle/examples/ESMF_FieldBundleCreateEx.F90
FAIL: mpiuni/O: src/Infrastructure/Grid/examples/ESMF_GridCreateRegFromDGEx.F90
FAIL: mpiuni/O: src/Infrastructure/Grid/examples/ESMF_GridUsageEx.F90
FAIL: mpiuni/O: src/Infrastructure/LocStream/examples/ESMF_LocStreamEx.F90
FAIL: mpiuni/O: src/Infrastructure/LogErr/examples/ESMF_LogErrEx.F90
FAIL: mpiuni/O: src/Infrastructure/Route/examples/ESMF_RHandleDynamicMaskingEx.F90
FAIL: mpiuni/O: src/Infrastructure/Route/examples/ESMF_RHandleFromFileEx.F90
FAIL: mpiuni/O: src/Infrastructure/Route/examples/ESMF_RHandleReusabilityEx.F90
FAIL: mpiuni/O: src/Infrastructure/TimeMgr/examples/ESMF_AlarmEx.F90
FAIL: mpiuni/O: src/Infrastructure/TimeMgr/examples/ESMF_CalendarEx.F90
FAIL: mpiuni/O: src/Infrastructure/TimeMgr/examples/ESMF_ClockEx.F90
FAIL: mpiuni/O: src/Infrastructure/TimeMgr/examples/ESMF_TimeEx.F90
FAIL: mpiuni/O: src/Infrastructure/TimeMgr/examples/ESMF_TimeIntervalEx.F90
FAIL: mpiuni/O: src/Infrastructure/Trace/examples/ESMF_TraceEx.F90
FAIL: mpiuni/O: src/Infrastructure/Trace/examples/ESMF_TraceUserEx.F90
FAIL: mpiuni/O: src/Infrastructure/VM/examples/ESMF_VMAllFullReduceEx.F90
FAIL: mpiuni/O: src/Infrastructure/VM/examples/ESMF_VMComponentEx.F90
FAIL: mpiuni/O: src/Infrastructure/VM/examples/ESMF_VMDefaultBasicsEx.F90
FAIL: mpiuni/O: src/Infrastructure/VM/examples/ESMF_VMGetMPICommunicatorEx.F90
FAIL: mpiuni/O: src/Infrastructure/VM/examples/ESMF_VMHigherRankDataEx.F90
FAIL: mpiuni/O: src/Infrastructure/VM/examples/ESMF_VMNonBlockingEx.F90
FAIL: mpiuni/O: src/Infrastructure/VM/examples/ESMF_VMScatterVMGatherEx.F90
FAIL: mpiuni/O: src/Infrastructure/VM/examples/ESMF_VMSendVMRecvEx.F90
FAIL: mpiuni/O: src/Infrastructure/VM/examples/ESMF_VMUserMpiCommEx.F90
FAIL: mpiuni/O: src/Infrastructure/VM/examples/ESMF_VMUserMpiCommMultiEx.F90
FAIL: mpiuni/O: src/Infrastructure/VM/examples/ESMF_VMUserMpiEx.F90
FAIL: mpiuni/O: src/Infrastructure/XGrid/examples/ESMF_XGridSparseMatEx.F90
FAIL: mpiuni/O: src/Superstructure/AttachMethods/examples/ESMF_AttachMethodsEx.F90
FAIL: mpiuni/O: src/Superstructure/Component/examples/ESMF_AppMainEx.F90
FAIL: mpiuni/O: src/Superstructure/Component/examples/ESMF_CplEx.F90
FAIL: mpiuni/O: src/Superstructure/Component/examples/ESMF_GCompEx.F90
FAIL: mpiuni/O: src/Superstructure/Component/examples/ESMF_InternalStateEx.F90
FAIL: mpiuni/O: src/Superstructure/Component/examples/ESMF_InternalStateModEx.F90
FAIL: mpiuni/O: src/Superstructure/Component/examples/ESMF_SCompEx.F90
FAIL: mpiuni/O: src/Superstructure/State/examples/ESMF_StateEx.F90
FAIL: mpiuni/O: src/Superstructure/State/examples/ESMF_StateReadWriteEx.F90
FAIL: mpiuni/O: src/Superstructure/State/examples/ESMF_StateReconcileEx.F90
FAIL: mpiuni/O: src/addon/NUOPC/examples/ESMF_NUOPCAtmModelEx.F90
FAIL: mpiuni/O: src/addon/NUOPC/examples/ESMF_NUOPCBasicModelEx.F90




The stdout files for the examples can be found at:
/project/esmf/himanshu/esmf_test/cronjobs/daily/gfortran_clang/esmf/examples/examplesO/Darwin.gfortranclang.64.mpiuni.default


Found 43 single processor examples, 0 passed and 43 failed.



|-------------------- EXHAUSTIVE UNIT TESTS -------------------|
Sat Aug 15 20:11:21 MDT 2020 build_unit_tests .............PASS
Sat Aug 15 20:13:33 MDT 2020 run_unit_tests_uni ...........PASS




The following unit test files failed to build, failed to execute or crashed during execution:

CRASHED: mpiuni/O: src/Infrastructure/Array/tests/ESMC_ArrayUTest.C
CRASHED: mpiuni/O: src/Infrastructure/Array/tests/ESMF_ArrayDataUTest.F90
CRASHED: mpiuni/O: src/Infrastructure/Array/tests/ESMF_ArraySMMFromFileUTest.F90
CRASHED: mpiuni/O: src/Infrastructure/Array/tests/ESMF_ArraySMMUTest.F90
CRASHED: mpiuni/O: src/Infrastructure/ArrayBundle/tests/ESMF_ArrayBundleCreateUTest.F90
CRASHED: mpiuni/O: src/Infrastructure/ArrayBundle/tests/ESMF_ArrayBundleRedistUTest.F90
CRASHED: mpiuni/O: src/Infrastructure/ArraySpec/tests/ESMC_ArraySpecUTest.C
CRASHED: mpiuni/O: src/Infrastructure/ArraySpec/tests/ESMF_ArraySpecUTest.F90
CRASHED: mpiuni/O: src/Infrastructure/Base/tests/ESMC_BaseUTest.C
CRASHED: mpiuni/O: src/Infrastructure/Base/tests/ESMC_InfoUTest.C
CRASHED: mpiuni/O: src/Infrastructure/Base/tests/ESMC_NlohmannJSONUTest.C
CRASHED: mpiuni/O: src/Infrastructure/Base/tests/ESMF_BaseUTest.F90
CRASHED: mpiuni/O: src/Infrastructure/Base/tests/ESMF_InfoArrayUTest.F90
CRASHED: mpiuni/O: src/Infrastructure/Base/tests/ESMF_InfoUTest.F90
CRASHED: mpiuni/O: src/Infrastructure/Config/tests/ESMC_ConfigUTest.C
CRASHED: mpiuni/O: src/Infrastructure/Config/tests/ESMF_ConfigUTest.F90
CRASHED: mpiuni/O: src/Infrastructure/Container/tests/ESMF_ContainerUTest.F90
CRASHED: mpiuni/O: src/Infrastructure/DELayout/tests/ESMF_DELayoutUTest.F90
CRASHED: mpiuni/O: src/Infrastructure/DELayout/tests/ESMF_DELayoutWorkQueueUTest.F90
CRASHED: mpiuni/O: src/Infrastructure/DistGrid/tests/ESMC_DistGridUTest.C
CRASHED: mpiuni/O: src/Infrastructure/DistGrid/tests/ESMF_DistGridCreateGetUTest.F90
CRASHED: mpiuni/O: src/Infrastructure/Field/tests/ESMC_FieldGridGridRegridCsrvUTest.C
CRASHED: mpiuni/O: src/Infrastructure/Field/tests/ESMC_FieldGridGridRegridUTest.C
CRASHED: mpiuni/O: src/Infrastructure/Field/tests/ESMC_FieldGridRegrid2UTest.C
CRASHED: mpiuni/O: src/Infrastructure/Field/tests/ESMC_FieldGridRegridCsrv2UTest.C
CRASHED: mpiuni/O: src/Infrastructure/Field/tests/ESMC_FieldGridRegridCsrvUTest.C
CRASHED: mpiuni/O: src/Infrastructure/Field/tests/ESMC_FieldGridRegridUTest.C
CRASHED: mpiuni/O: src/Infrastructure/Field/tests/ESMC_FieldRegridCsrvUTest.C
CRASHED: mpiuni/O: src/Infrastructure/Field/tests/ESMC_FieldRegridUTest.C
CRASHED: mpiuni/O: src/Infrastructure/Field/tests/ESMC_FieldSMMFromFileUTest.C
CRASHED: mpiuni/O: src/Infrastructure/Field/tests/ESMC_FieldUTest.C
CRASHED: mpiuni/O: src/Infrastructure/Field/tests/ESMF_FieldArbGridUTest.F90
CRASHED: mpiuni/O: src/Infrastructure/Field/tests/ESMF_FieldRedistArbUTest.F90
CRASHED: mpiuni/O: src/Infrastructure/Field/tests/ESMF_FieldRegridCSUTest.F90
CRASHED: mpiuni/O: src/Infrastructure/Field/tests/ESMF_FieldRegridCsrv2ndUTest.F90
CRASHED: mpiuni/O: src/Infrastructure/Field/tests/ESMF_FieldRegridCsrvUTest.F90
CRASHED: mpiuni/O: src/Infrastructure/Field/tests/ESMF_FieldRegridUTest.F90
CRASHED: mpiuni/O: src/Infrastructure/Field/tests/ESMF_FieldRegridXGUTest.F90
CRASHED: mpiuni/O: src/Infrastructure/Field/tests/ESMF_FieldSMMFromFileUTest.F90
CRASHED: mpiuni/O: src/Infrastructure/Field/tests/ESMF_FieldStressUTest.F90
CRASHED: mpiuni/O: src/Infrastructure/FieldBundle/tests/ESMF_FieldBundleRegridUTest.F90
CRASHED: mpiuni/O: src/Infrastructure/FieldBundle/tests/ESMF_FieldBundleUTest.F90
CRASHED: mpiuni/O: src/Infrastructure/Grid/tests/ESMC_GridUTest.C
CRASHED: mpiuni/O: src/Infrastructure/Grid/tests/ESMF_GridArbitraryUTest.F90
CRASHED: mpiuni/O: src/Infrastructure/Grid/tests/ESMF_GridCoordUTest.F90
CRASHED: mpiuni/O: src/Infrastructure/Grid/tests/ESMF_GridCreateUTest.F90
CRASHED: mpiuni/O: src/Infrastructure/Grid/tests/ESMF_GridItemUTest.F90
CRASHED: mpiuni/O: src/Infrastructure/IO/tests/ESMCI_IO_NetCDFUTest.C
CRASHED: mpiuni/O: src/Infrastructure/IO/tests/ESMCI_IO_PIOUTest.C
CRASHED: mpiuni/O: src/Infrastructure/IO/tests/ESMC_IO_InqUTest.C
CRASHED: mpiuni/O: src/Infrastructure/IO/tests/ESMF_IOUTest.F90
CRASHED: mpiuni/O: src/Infrastructure/IO/tests/ESMF_IO_PIOUTest.F90
CRASHED: mpiuni/O: src/Infrastructure/IO/tests/ESMF_IO_YAMLUTest.F90
CRASHED: mpiuni/O: src/Infrastructure/LocStream/tests/ESMC_LocStreamUTest.C
CRASHED: mpiuni/O: src/Infrastructure/LocStream/tests/ESMF_LocStreamUTest.F90
CRASHED: mpiuni/O: src/Infrastructure/LocalArray/tests/ESMF_LocalArrayDataUTest.F90
CRASHED: mpiuni/O: src/Infrastructure/LocalArray/tests/ESMF_LocalArrayUTest.F90
CRASHED: mpiuni/O: src/Infrastructure/LogErr/tests/ESMC_LogErrPerfUTest.C
CRASHED: mpiuni/O: src/Infrastructure/LogErr/tests/ESMC_LogErrUTest.C
CRASHED: mpiuni/O: src/Infrastructure/LogErr/tests/ESMF_LogErrPerfUTest.F90
CRASHED: mpiuni/O: src/Infrastructure/LogErr/tests/ESMF_LogErrUTest.F90
CRASHED: mpiuni/O: src/Infrastructure/Mesh/tests/ESMC_MBMesh_BilinearSingleElemUTest.C
CRASHED: mpiuni/O: src/Infrastructure/Mesh/tests/ESMC_MBMesh_BilinearUTest.C
CRASHED: mpiuni/O: src/Infrastructure/Mesh/tests/ESMC_MBMesh_CreateUTest.C
CRASHED: mpiuni/O: src/Infrastructure/Mesh/tests/ESMC_MBMesh_SearchUTest.C
CRASHED: mpiuni/O: src/Infrastructure/Mesh/tests/ESMC_MBMesh_SerializeUTest.C
CRASHED: mpiuni/O: src/Infrastructure/Mesh/tests/ESMC_MBMesh_UtilUTest.C
CRASHED: mpiuni/O: src/Infrastructure/Mesh/tests/ESMC_MeshMOABUTest.C
CRASHED: mpiuni/O: src/Infrastructure/Mesh/tests/ESMC_MeshUTest.C
CRASHED: mpiuni/O: src/Infrastructure/Mesh/tests/ESMC_Proj4UTest.C
CRASHED: mpiuni/O: src/Infrastructure/Mesh/tests/ESMF_MeshOpUTest.F90
CRASHED: mpiuni/O: src/Infrastructure/Mesh/tests/ESMF_MeshUTest.F90
CRASHED: mpiuni/O: src/Infrastructure/PointList/tests/ESMF_PointListUTest.F90
CRASHED: mpiuni/O: src/Infrastructure/Route/tests/ESMF_RouteHandleUTest.F90
CRASHED: mpiuni/O: src/Infrastructure/TimeMgr/tests/ESMC_CalendarUTest.C
CRASHED: mpiuni/O: src/Infrastructure/TimeMgr/tests/ESMC_ClockUTest.C
CRASHED: mpiuni/O: src/Infrastructure/TimeMgr/tests/ESMC_TimeIntervalUTest.C
CRASHED: mpiuni/O: src/Infrastructure/TimeMgr/tests/ESMC_TimeUTest.C
CRASHED: mpiuni/O: src/Infrastructure/TimeMgr/tests/ESMF_AlarmUTest.F90
CRASHED: mpiuni/O: src/Infrastructure/TimeMgr/tests/ESMF_CalRangeUTest.F90
CRASHED: mpiuni/O: src/Infrastructure/TimeMgr/tests/ESMF_CalendarUTest.F90
CRASHED: mpiuni/O: src/Infrastructure/TimeMgr/tests/ESMF_ClockUTest.F90
CRASHED: mpiuni/O: src/Infrastructure/TimeMgr/tests/ESMF_TimeIntervalUTest.F90
CRASHED: mpiuni/O: src/Infrastructure/TimeMgr/tests/ESMF_TimeUTest.F90
CRASHED: mpiuni/O: src/Infrastructure/Trace/tests/ESMC_TraceRegionUTest.C
CRASHED: mpiuni/O: src/Infrastructure/Trace/tests/ESMF_ProfileUTest.F90
CRASHED: mpiuni/O: src/Infrastructure/Trace/tests/ESMF_TraceClkMonoSyncUTest.F90
CRASHED: mpiuni/O: src/Infrastructure/Trace/tests/ESMF_TraceClkMonoUTest.F90
CRASHED: mpiuni/O: src/Infrastructure/Trace/tests/ESMF_TraceIOUTest.F90
CRASHED: mpiuni/O: src/Infrastructure/Trace/tests/ESMF_TraceMPIUTest.F90
CRASHED: mpiuni/O: src/Infrastructure/Trace/tests/ESMF_TraceUTest.F90
CRASHED: mpiuni/O: src/Infrastructure/Util/tests/ESMF_FortranWordsizeUTest.F90
CRASHED: mpiuni/O: src/Infrastructure/Util/tests/ESMF_InitMacrosUTest.F90
CRASHED: mpiuni/O: src/Infrastructure/Util/tests/ESMF_TypeKindGetUTest.F90
CRASHED: mpiuni/O: src/Infrastructure/Util/tests/ESMF_UtilUTest.F90
CRASHED: mpiuni/O: src/Infrastructure/VM/tests/ESMC_VMUTest.C
CRASHED: mpiuni/O: src/Infrastructure/VM/tests/ESMF_VMAccUTest.F90
CRASHED: mpiuni/O: src/Infrastructure/VM/tests/ESMF_VMAllGatherUTest.F90
CRASHED: mpiuni/O: src/Infrastructure/VM/tests/ESMF_VMAllGatherVUTest.F90
CRASHED: mpiuni/O: src/Infrastructure/VM/tests/ESMF_VMAllToAllUTest.F90
CRASHED: mpiuni/O: src/Infrastructure/VM/tests/ESMF_VMAllToAllVUTest.F90
CRASHED: mpiuni/O: src/Infrastructure/VM/tests/ESMF_VMBarrierUTest.F90
CRASHED: mpiuni/O: src/Infrastructure/VM/tests/ESMF_VMBroadcastUTest.F90
CRASHED: mpiuni/O: src/Infrastructure/VM/tests/ESMF_VMComponentUTest.F90
CRASHED: mpiuni/O: src/Infrastructure/VM/tests/ESMF_VMGatherUTest.F90
CRASHED: mpiuni/O: src/Infrastructure/VM/tests/ESMF_VMOpenMPUTest.F90
CRASHED: mpiuni/O: src/Infrastructure/VM/tests/ESMF_VMScatterUTest.F90
CRASHED: mpiuni/O: src/Infrastructure/VM/tests/ESMF_VMSendNbVMRecvNbUTest.F90
CRASHED: mpiuni/O: src/Infrastructure/VM/tests/ESMF_VMSendRecvNbUTest.F90
CRASHED: mpiuni/O: src/Infrastructure/VM/tests/ESMF_VMSendRecvUTest.F90
CRASHED: mpiuni/O: src/Infrastructure/VM/tests/ESMF_VMUTest.F90
CRASHED: mpiuni/O: src/Infrastructure/VM/tests/ESMF_VMUserMpiInitUTest.F90
CRASHED: mpiuni/O: src/Infrastructure/XGrid/tests/ESMC_XGridUTest.C
CRASHED: mpiuni/O: src/Infrastructure/XGrid/tests/ESMF_XGridMaskingUTest.F90
CRASHED: mpiuni/O: src/Infrastructure/XGrid/tests/ESMF_XGridUTest.F90
CRASHED: mpiuni/O: src/Superstructure/AttributeAPI/tests/ESMF_AttPackABundleUTest.F90
CRASHED: mpiuni/O: src/Superstructure/AttributeAPI/tests/ESMF_AttPackArrayUTest.F90
CRASHED: mpiuni/O: src/Superstructure/AttributeAPI/tests/ESMF_AttPackCplCompUTest.F90
CRASHED: mpiuni/O: src/Superstructure/AttributeAPI/tests/ESMF_AttPackDistGridUTest.F90
CRASHED: mpiuni/O: src/Superstructure/AttributeAPI/tests/ESMF_AttPackFBundleUTest.F90
CRASHED: mpiuni/O: src/Superstructure/AttributeAPI/tests/ESMF_AttPackFieldUTest.F90
CRASHED: mpiuni/O: src/Superstructure/AttributeAPI/tests/ESMF_AttPackGridCompUTest.F90
CRASHED: mpiuni/O: src/Superstructure/AttributeAPI/tests/ESMF_AttPackGridUTest.F90
CRASHED: mpiuni/O: src/Superstructure/AttributeAPI/tests/ESMF_AttPackLocStreamUTest.F90
CRASHED: mpiuni/O: src/Superstructure/AttributeAPI/tests/ESMF_AttPackSciCompUTest.F90
CRASHED: mpiuni/O: src/Superstructure/AttributeAPI/tests/ESMF_AttPackStateUTest.F90
CRASHED: mpiuni/O: src/Superstructure/AttributeAPI/tests/ESMF_AttributeABundleUTest.F90
CRASHED: mpiuni/O: src/Superstructure/AttributeAPI/tests/ESMF_AttributeArrayUTest.F90
CRASHED: mpiuni/O: src/Superstructure/AttributeAPI/tests/ESMF_AttributeCplCompUTest.F90
CRASHED: mpiuni/O: src/Superstructure/AttributeAPI/tests/ESMF_AttributeDistGridUTest.F90
CRASHED: mpiuni/O: src/Superstructure/AttributeAPI/tests/ESMF_AttributeFBundleUTest.F90
CRASHED: mpiuni/O: src/Superstructure/AttributeAPI/tests/ESMF_AttributeFieldUTest.F90
CRASHED: mpiuni/O: src/Superstructure/AttributeAPI/tests/ESMF_AttributeGridCompUTest.F90
CRASHED: mpiuni/O: src/Superstructure/AttributeAPI/tests/ESMF_AttributeGridUTest.F90
CRASHED: mpiuni/O: src/Superstructure/AttributeAPI/tests/ESMF_AttributeLocStreamUTest.F90
CRASHED: mpiuni/O: src/Superstructure/AttributeAPI/tests/ESMF_AttributeSciCompUTest.F90
CRASHED: mpiuni/O: src/Superstructure/AttributeAPI/tests/ESMF_AttributeStateUTest.F90
CRASHED: mpiuni/O: src/Superstructure/AttributeAPI/tests/ESMF_AttributeUtilUTest.F90
CRASHED: mpiuni/O: src/Superstructure/Component/tests/ESMC_ComponentUTest.C
CRASHED: mpiuni/O: src/Superstructure/Component/tests/ESMF_CompSetServUTest.F90
CRASHED: mpiuni/O: src/Superstructure/Component/tests/ESMF_ComponentUTest.F90
CRASHED: mpiuni/O: src/Superstructure/Component/tests/ESMF_CplCompCreateUTest.F90
CRASHED: mpiuni/O: src/Superstructure/Component/tests/ESMF_GridCompCreateUTest.F90
CRASHED: mpiuni/O: src/Superstructure/Component/tests/ESMF_SciCompCreateUTest.F90
CRASHED: mpiuni/O: src/Superstructure/Component/tests/ESMF_StdCompMethodsUTest.F90
CRASHED: mpiuni/O: src/Superstructure/ESMFMod/tests/ESMF_FrameworkUTest.F90
CRASHED: mpiuni/O: src/Superstructure/IOAPI/tests/ESMF_IOCompUTest.F90
CRASHED: mpiuni/O: src/Superstructure/InfoAPI/tests/ESMF_InfoDescribeUTest.F90
CRASHED: mpiuni/O: src/Superstructure/InfoAPI/tests/ESMF_InfoGetInterfaceArrayUTest.F90
CRASHED: mpiuni/O: src/Superstructure/InfoAPI/tests/ESMF_InfoSyncUTest.F90
CRASHED: mpiuni/O: src/Superstructure/PreESMFMod/tests/ESMF_FileRegridUTest.F90
CRASHED: mpiuni/O: src/Superstructure/PreESMFMod/tests/ESMF_RegridWeightGenUTest.F90
CRASHED: mpiuni/O: src/Superstructure/State/tests/ESMC_StateUTest.C
CRASHED: mpiuni/O: src/Superstructure/State/tests/ESMF_StateCreateUTest.F90
CRASHED: mpiuni/O: src/Superstructure/State/tests/ESMF_StateReadWriteUTest.F90
CRASHED: mpiuni/O: src/Superstructure/State/tests/ESMF_StateUTest.F90
CRASHED: mpiuni/O: src/addon/NUOPC/tests/ESMF_NUOPC_UTest.F90
CRASHED: mpiuni/O: src/epilogue/tests/ESMCI_TestUTest.C
CRASHED: mpiuni/O: src/epilogue/tests/ESMC_TestUTest.C
CRASHED: mpiuni/O: src/epilogue/tests/ESMF_TestUTest.F90
CRASHED: mpiuni/O: src/prologue/tests/ESMCI_ExceptionsUTest.C
CRASHED: mpiuni/O: src/prologue/tests/ESMCI_FeatureUTest.C
CRASHED: mpiuni/O: src/prologue/tests/ESMF_F90ArrayPtrUTest.F90
CRASHED: mpiuni/O: src/prologue/tests/ESMF_FeatureUTest.F90
CRASHED: mpiuni/O: src/prologue/tests/ESMF_LAPACKUTest.F90
CRASHED: mpiuni/O: src/prologue/tests/ESMF_StringUTest.F90
CRASHED: mpiuni/O: src/prologue/tests/ESMF_WordsizeUTest.F90


The following test harness unit tests fail, did not build, or did not execute:
FAIL: mpiuni/O: ESMF_array_default_NP1UTest
FAIL: mpiuni/O: ESMF_field_default_NP1UTest


The log and stdout files for the unit tests can be found at:
/project/esmf/himanshu/esmf_test/cronjobs/daily/gfortran_clang/esmf/test/testO/Darwin.gfortranclang.64.mpiuni.default


Found 7252 exhaustive single processor unit tests, 0 passed and 7252 failed.



_______________________________________________________________________________________________

Sat Aug 15 20:15:17 MDT 2020 on cgdm-catania 

ESMF Checkout Source: https://github.com/esmf-org/esmf.git

Compiler and configuration information:

-------------------------------------------------------------- 
Currently Loaded Modulefiles:
 1) GCC/Homebrew/9.3.0_1/gcc   2) GCC/Homebrew/9.3.0_1/mpich/3.3.2   3) GCC/Homebrew/9.3.0_1/netcdf/4.7.4s  

Repository:
origin	https://github.com/esmf-org/esmf.git (fetch)
origin	https://github.com/esmf-org/esmf.git (push)
 
ESMF_8_1_0_beta_snapshot_25-23-g5724188759
 
 
/project/esmf/GCC/Homebrew/9.3.0_1/mpich/3.3.2/bin/mpif90: line 376: /project/esmf/GCC/Homebrew/9.3.0_1/gfortran: No such file or directory
 
--------------------------------------------------------------
ESMF_VERSION_STRING:    8.1.0 beta snapshot
ESMF_8_1_0_beta_snapshot_25-23-g5724188759
--------------------------------------------------------------
On branch develop
Your branch is up to date with 'origin/develop'.

Untracked files:
  (use "git add ..." to include in what will be committed)

	src/installcheck/esmc_application
	src/installcheck/esmc_application.o
	src/installcheck/esmf_application
	src/installcheck/esmf_application.o
	tmp

nothing added to commit but untracked files present (use "git add" to track)
--------------------------------------------------------------
 
--------------------------------------------------------------
Make version:
GNU Make 3.81
Copyright (C) 2006  Free Software Foundation, Inc.
This is free software; see the source for copying conditions.
There is NO warranty; not even for MERCHANTABILITY or FITNESS FOR A
PARTICULAR PURPOSE.

This program built for i386-apple-darwin11.3.0

--------------------------------------------------------------
Fortran Compiler version:
mpifort for MPICH version 3.3.2
/project/esmf/GCC/Homebrew/9.3.0_1/mpich/3.3.2/bin/mpif90: line 376: /project/esmf/GCC/Homebrew/9.3.0_1/gfortran: No such file or directory

--------------------------------------------------------------
C++ Compiler version:
mpicxx for MPICH version 3.3.2
/project/esmf/GCC/Homebrew/9.3.0_1/mpich/3.3.2/bin/mpicxx: line 283: /project/esmf/GCC/Homebrew/9.3.0_1/g++: No such file or directory

--------------------------------------------------------------
Preprocessor version:
Apple LLVM version 10.0.1 (clang-1001.0.46.4)
Target: x86_64-apple-darwin18.7.0
Thread model: posix
InstalledDir: /Library/Developer/CommandLineTools/usr/bin
--------------------------------------------------------------
NetCDF library version: netCDF 4.7.4
NetCDF Fortran version: netCDF-Fortran 4.5.3
 
--------------------------------------------------------------
 * User set ESMF environment variables *
ESMF_ABI=64
ESMF_BOPT=g
ESMF_COMM=mpich3
ESMF_COMPILER=gfortranclang
ESMF_DIR=/project/esmf/himanshu/esmf_test/cronjobs/daily/gfortran_clang/esmf
ESMF_INSTALL_PREFIX=/project/esmf/himanshu/esmf_test/cronjobs/daily/gfortran_clang/install_dir
ESMF_NETCDF=nc-config
ESMF_OS=Darwin
ESMF_SITE=default
ESMF_TESTEXHAUSTIVE=ON
ESMF_TESTMPMD=OFF
ESMF_TESTWITHTHREADS=ON
 
--------------------------------------------------------------
 * ESMF environment variables *
ESMF_DIR: /project/esmf/himanshu/esmf_test/cronjobs/daily/gfortran_clang/esmf
ESMF_OS:                Darwin
ESMF_MACHINE:           x86_64
ESMF_ABI:               64
ESMF_COMPILER:          gfortranclang
ESMF_BOPT:              g
ESMF_COMM:              mpich3
ESMF_SITE:              default
ESMF_PTHREADS:          OFF
ESMF_OPENMP:            OFF
ESMF_OPENACC:           OFF
ESMF_CXXSTD:            11
ESMF_ARRAY_LITE:        FALSE
ESMF_NO_INTEGER_1_BYTE: TRUE
ESMF_NO_INTEGER_2_BYTE: TRUE
ESMF_FORTRANSYMBOLS:    default
ESMF_MAPPER_BUILD:      OFF
ESMF_AUTO_LIB_BUILD:    ON
ESMF_DEFER_LIB_BUILD:   ON
ESMF_SHARED_LIB_BUILD:  ON
ESMF_TRACE_LIB_BUILD:   ON
ESMF_TESTEXHAUSTIVE:    ON
ESMF_TESTCOMPTUNNEL:    ON
ESMF_TESTWITHTHREADS:   ON
ESMF_TESTMPMD:          OFF
ESMF_TESTSHAREDOBJ:     OFF
ESMF_TESTFORCEOPENMP:   OFF
ESMF_TESTFORCEOPENACC:  OFF
ESMF_TESTHARNESS_ARRAY: default
ESMF_TESTHARNESS_FIELD: default
ESMF_MPIRUN:            mpirun 
 
--------------------------------------------------------------
 * ESMF environment variables pointing to 3rd party software *
ESMF_MOAB:               internal
ESMF_LAPACK:             internal
ESMF_ACC_SOFTWARE_STACK: none
ESMF_NETCDF:             nc-config
ESMF_NETCDF_INCLUDE:     /project/esmf/GCC/Homebrew/9.3.0_1/netcdf/4.7.4/include
ESMF_NETCDF_LIBS:        -lnetcdf
ESMF_NETCDF_LIBPATH:     /project/esmf/GCC/Homebrew/9.3.0_1/netcdf/4.7.4/lib
ESMF_NFCONFIG:           nf-config
ESMF_NETCDFF_INCLUDE:    /project/esmf/GCC/Homebrew/9.3.0_1/netcdf/4.7.4/include
ESMF_NETCDFF_LIBS:       -lnetcdff
ESMF_NETCDFF_LIBPATH:    /project/esmf/GCC/Homebrew/9.3.0_1/netcdf/4.7.4/lib
ESMF_YAMLCPP:            internal
ESMF_PIO:                internal
 
--------------------------------------------------------------
 * ESMF environment variables for final installation *
ESMF_INSTALL_PREFIX:    /project/esmf/himanshu/esmf_test/cronjobs/daily/gfortran_clang/install_dir
ESMF_INSTALL_HEADERDIR: include
ESMF_INSTALL_MODDIR:    mod/modg/Darwin.gfortranclang.64.mpich3.default
ESMF_INSTALL_LIBDIR:    lib/libg/Darwin.gfortranclang.64.mpich3.default
ESMF_INSTALL_BINDIR:    bin/bing/Darwin.gfortranclang.64.mpich3.default
ESMF_INSTALL_DOCDIR:    doc
 
--------------------------------------------------------------
 * ESMF Benchmark directory and parameters *
ESMF_BENCHMARK_PREFIX:         ./DEFAULTBENCHMARKDIR
ESMF_BENCHMARK_TOLERANCE:      20%
ESMF_BENCHMARK_THRESHOLD_MSEC: 500
 
--------------------------------------------------------------
 * Other relevant environment variables *
PATH:    /project/esmf/GCC/Homebrew/9.3.0_1/netcdf/4.7.4/bin:/project/esmf/GCC/Homebrew/9.3.0_1/mpich/3.3.2/bin:/project/esmf/GCC/Homebrew/9.3.0_1:/project/esmf/Modules/bin:/home/himanshu/bin:/usr/local/bin:/usr/bin:/bin:/usr/sbin:/sbin:/opt/local/bin:/opt/local/sbin:/opt/X11/bin
LD_LIBRARY_PATH: 
 
dyld: Library not loaded: /usr/local/opt/gcc/lib/gcc/9/libgfortran.5.dylib
  Referenced from: /project/esmf/GCC/Homebrew/9.3.0_1/mpich/3.3.2/lib/libmpi.12.dylib
  Reason: image not found
/project/esmf/himanshu/esmf_test/cronjobs/daily/gfortran_clang/esmf/scripts/libs.mpich3f90: line 5: [: =: unary operator expected
/project/esmf/himanshu/esmf_test/cronjobs/daily/gfortran_clang/esmf/scripts/libs.mpich3f90: line 5: [: =: unary operator expected
dyld: Library not loaded: /usr/local/opt/gcc/lib/gcc/9/libgfortran.5.dylib
  Referenced from: /project/esmf/GCC/Homebrew/9.3.0_1/mpich/3.3.2/lib/libmpi.12.dylib
  Reason: image not found
/project/esmf/himanshu/esmf_test/cronjobs/daily/gfortran_clang/esmf/scripts/libs.mpich3f90: line 5: [: =: unary operator expected
/project/esmf/himanshu/esmf_test/cronjobs/daily/gfortran_clang/esmf/scripts/libs.mpich3f90: line 5: [: =: unary operator expected
dyld: Library not loaded: /usr/local/opt/gcc/lib/gcc/9/libgfortran.5.dylib
  Referenced from: /project/esmf/GCC/Homebrew/9.3.0_1/mpich/3.3.2/lib/libmpi.12.dylib
  Reason: image not found
/project/esmf/himanshu/esmf_test/cronjobs/daily/gfortran_clang/esmf/scripts/libs.mpich3f90: line 5: [: =: unary operator expected
/project/esmf/himanshu/esmf_test/cronjobs/daily/gfortran_clang/esmf/scripts/libs.mpich3f90: line 5: [: =: unary operator expected
--------------------------------------------------------------
 * Compilers, Linkers, Flags, and Libraries *
Location of the preprocessor:      /usr/bin/clang
Location of the Fortran compiler:  /project/esmf/GCC/Homebrew/9.3.0_1/mpich/3.3.2/bin/mpif90
Location of the Fortran linker:    /project/esmf/GCC/Homebrew/9.3.0_1/mpich/3.3.2/bin/mpif90
Location of the C++ compiler:      /project/esmf/GCC/Homebrew/9.3.0_1/mpich/3.3.2/bin/mpicxx
Location of the C++ linker:        /project/esmf/GCC/Homebrew/9.3.0_1/mpich/3.3.2/bin/mpicxx

Fortran compiler flags:
ESMF_F90COMPILER: mpif90
ESMF_F90COMPILEOPTS: -g -Wall -Wno-unused -Wno-unused-dummy-argument -fbacktrace -fbounds-check   -m64 -mcmodel=small -ffree-line-length-none
ESMF_F90COMPILEPATHS: -I/project/esmf/himanshu/esmf_test/cronjobs/daily/gfortran_clang/esmf/mod/modg/Darwin.gfortranclang.64.mpich3.default -I/project/esmf/himanshu/esmf_test/cronjobs/daily/gfortran_clang/esmf/src/include -I/project/esmf/GCC/Homebrew/9.3.0_1/netcdf/4.7.4/include -I/project/esmf/GCC/Homebrew/9.3.0_1/netcdf/4.7.4/include
ESMF_F90COMPILECPPFLAGS: -DESMF_NO_INTEGER_1_BYTE -DESMF_NO_INTEGER_2_BYTE -DESMFVERSIONGIT='ESMF_8_1_0_beta_snapshot_25-23-g5724188759' -DESMF_MOAB=1 -DESMF_LAPACK=1 -DESMF_LAPACK_INTERNAL=1 -DESMF_NO_ACC_SOFTWARE_STACK=1 -DESMF_NETCDF=1 -DESMF_YAMLCPP=1 -DESMF_YAML=1 -DESMF_PIO=1 -DESMF_MPIIO -DESMF_NO_PTHREADS -DESMF_NO_OPENMP -DESMF_NO_OPENACC -DESMF_TESTEXHAUSTIVE -DESMF_BOPT_g -DESMF_TESTCOMPTUNNEL -DESMF_TESTWITHTHREADS -DSx86_64_small=1 -DESMF_OS_Darwin=1 -DESMF_COMM=mpich3 -DESMF_DIR=/project/esmf/himanshu/esmf_test/cronjobs/daily/gfortran_clang/esmf
ESMF_F90COMPILEFREECPP: 
ESMF_F90COMPILEFREENOCPP: -ffree-form
ESMF_F90COMPILEFIXCPP: -cpp -ffixed-form
ESMF_F90COMPILEFIXNOCPP: 

Fortran linker flags:
ESMF_F90LINKOPTS:    -m64 -mcmodel=small
ESMF_F90LINKPATHS: -L/project/esmf/himanshu/esmf_test/cronjobs/daily/gfortran_clang/esmf/lib/libg/Darwin.gfortranclang.64.mpich3.default -L/project/esmf/GCC/Homebrew/9.3.0_1/netcdf/4.7.4/lib -L/project/esmf/GCC/Homebrew/9.3.0_1/netcdf/4.7.4/lib
ESMF_F90LINKRPATHS: -Wl,-rpath,/project/esmf/himanshu/esmf_test/cronjobs/daily/gfortran_clang/esmf/lib/libg/Darwin.gfortranclang.64.mpich3.default -Wl,-rpath,/project/esmf/GCC/Homebrew/9.3.0_1/netcdf/4.7.4/lib -Wl,-rpath,/project/esmf/GCC/Homebrew/9.3.0_1/netcdf/4.7.4/lib
ESMF_F90LINKLIBS:  -lstdc++ -lc++ -lnetcdf -lnetcdff
ESMF_F90ESMFLINKLIBS: -lesmf  -lstdc++ -lc++ -lnetcdf -lnetcdff

C++ compiler flags:
ESMF_CXXCOMPILER: mpicxx
ESMF_CXXCOMPILEOPTS: -std=c++11 -g -Wall -Wextra -Wno-unused  -DESMF_LOWERCASE_SINGLEUNDERSCORE -m64 -mcmodel=small
ESMF_CXXCOMPILEPATHS:  -I/project/esmf/himanshu/esmf_test/cronjobs/daily/gfortran_clang/esmf/src/include  -I/project/esmf/GCC/Homebrew/9.3.0_1/netcdf/4.7.4/include -I/project/esmf/himanshu/esmf_test/cronjobs/daily/gfortran_clang/esmf/src/prologue/yaml-cpp/include
ESMF_CXXCOMPILECPPFLAGS: -DESMF_NO_INTEGER_1_BYTE -DESMF_NO_INTEGER_2_BYTE -DESMFVERSIONGIT='ESMF_8_1_0_beta_snapshot_25-23-g5724188759' -DESMF_MOAB=1 -DESMF_LAPACK=1 -DESMF_LAPACK_INTERNAL=1 -DESMF_NO_ACC_SOFTWARE_STACK=1 -DESMF_NETCDF=1 -DESMF_YAMLCPP=1 -DESMF_YAML=1 -DESMF_PIO=1 -DESMF_MPIIO -DESMF_NO_PTHREADS -DESMF_NO_OPENMP -DESMF_NO_OPENACC -DESMF_TESTEXHAUSTIVE -DESMF_BOPT_g -DESMF_TESTCOMPTUNNEL -DESMF_TESTWITHTHREADS -DSx86_64_small=1 -DESMF_OS_Darwin=1 -DESMF_COMM=mpich3 -DESMF_DIR=/project/esmf/himanshu/esmf_test/cronjobs/daily/gfortran_clang/esmf -D__SDIR__='' -DESMF_CXXSTD=11 -x c++

C++ linker flags:
ESMF_CXXLINKOPTS:   -m64 -mcmodel=small
ESMF_CXXLINKPATHS: -L/project/esmf/himanshu/esmf_test/cronjobs/daily/gfortran_clang/esmf/lib/libg/Darwin.gfortranclang.64.mpich3.default -L/project/esmf/GCC/Homebrew/9.3.0_1/netcdf/4.7.4/lib -L/project/esmf/GCC/Homebrew/9.3.0_1/netcdf/4.7.4/lib -L
ESMF_CXXLINKRPATHS: -Wl,-rpath,/project/esmf/himanshu/esmf_test/cronjobs/daily/gfortran_clang/esmf/lib/libg/Darwin.gfortranclang.64.mpich3.default -Wl,-rpath,/project/esmf/GCC/Homebrew/9.3.0_1/netcdf/4.7.4/lib -Wl,-rpath,/project/esmf/GCC/Homebrew/9.3.0_1/netcdf/4.7.4/lib -Wl,-rpath,
ESMF_CXXLINKLIBS:  -lmpifort -lgfortran -lstdc++ -lc++ -lnetcdf -lnetcdff
ESMF_CXXESMFLINKLIBS: -lesmf  -lmpifort -lgfortran -lstdc++ -lc++ -lnetcdf -lnetcdff

Shared library build:
ESMF_SL_LIBS_TO_MAKE: libesmf
ESMF_SL_SUFFIX:       dylib
ESMF_SL_LIBLINKER:    mpicxx
ESMF_SL_LIBOPTS:       -dynamiclib
ESMF_SL_LIBLIBS:       -L/project/esmf/himanshu/esmf_test/cronjobs/daily/gfortran_clang/esmf/lib/libg/Darwin.gfortranclang.64.mpich3.default -L/project/esmf/GCC/Homebrew/9.3.0_1/netcdf/4.7.4/lib -L/project/esmf/GCC/Homebrew/9.3.0_1/netcdf/4.7.4/lib  -lstdc++ -lc++ -lnetcdf -lnetcdff -L/project/esmf/himanshu/esmf_test/cronjobs/daily/gfortran_clang/esmf/lib/libg/Darwin.gfortranclang.64.mpich3.default -L/project/esmf/GCC/Homebrew/9.3.0_1/netcdf/4.7.4/lib -L/project/esmf/GCC/Homebrew/9.3.0_1/netcdf/4.7.4/lib -L  -lmpifort -lgfortran -lstdc++ -lc++ -lnetcdf -lnetcdff

ESMF Tracing linker options:
ESMF_TRACE_LDPRELOAD=/project/esmf/himanshu/esmf_test/cronjobs/daily/gfortran_clang/esmf/lib/libg/Darwin.gfortranclang.64.mpich3.default/libesmftrace_preload.dylib
ESMF_TRACE_STATICLINKOPTS=-static -Wl,--wrap=c_esmftrace_notify_wrappers -Wl,--wrap=c_esmftrace_isinitialized -Wl,--wrap=write -Wl,--wrap=writev -Wl,--wrap=pwrite -Wl,--wrap=read -Wl,--wrap=open -Wl,--wrap=MPI_Allgather -Wl,--wrap=MPI_Allgatherv -Wl,--wrap=MPI_Allreduce -Wl,--wrap=MPI_Alltoall -Wl,--wrap=MPI_Alltoallv -Wl,--wrap=MPI_Alltoallw -Wl,--wrap=MPI_Barrier -Wl,--wrap=MPI_Bcast -Wl,--wrap=MPI_Gather -Wl,--wrap=MPI_Gatherv -Wl,--wrap=MPI_Recv -Wl,--wrap=MPI_Reduce -Wl,--wrap=MPI_Scatter -Wl,--wrap=MPI_Send -Wl,--wrap=MPI_Sendrecv -Wl,--wrap=MPI_Wait -Wl,--wrap=MPI_Waitall -Wl,--wrap=MPI_Waitany -Wl,--wrap=MPI_Waitsome -Wl,--wrap=mpi_allgather_ -Wl,--wrap=mpi_allgather__ -Wl,--wrap=mpi_allgatherv_ -Wl,--wrap=mpi_allgatherv__ -Wl,--wrap=mpi_allreduce_ -Wl,--wrap=mpi_allreduce__ -Wl,--wrap=mpi_alltoall_ -Wl,--wrap=mpi_alltoall__ -Wl,--wrap=mpi_alltoallv_ -Wl,--wrap=mpi_alltoallv__ -Wl,--wrap=mpi_alltoallw_ -Wl,--wrap=mpi_alltoallw__ -Wl,--wrap=mpi_barrier_ -Wl,--wrap=mpi_barrier__ -Wl,--wrap=mpi_bcast_ -Wl,--wrap=mpi_bcast__ -Wl,--wrap=mpi_exscan_ -Wl,--wrap=mpi_exscan__ -Wl,--wrap=mpi_gather_ -Wl,--wrap=mpi_gather__ -Wl,--wrap=mpi_gatherv_ -Wl,--wrap=mpi_gatherv__ -Wl,--wrap=mpi_recv_ -Wl,--wrap=mpi_recv__ -Wl,--wrap=mpi_reduce_ -Wl,--wrap=mpi_reduce__ -Wl,--wrap=mpi_reduce_scatter_ -Wl,--wrap=mpi_reduce_scatter__ -Wl,--wrap=mpi_scatter_ -Wl,--wrap=mpi_scatter__ -Wl,--wrap=mpi_scatterv_ -Wl,--wrap=mpi_scatterv__ -Wl,--wrap=mpi_scan_ -Wl,--wrap=mpi_scan__ -Wl,--wrap=mpi_send_ -Wl,--wrap=mpi_send__ -Wl,--wrap=mpi_wait_ -Wl,--wrap=mpi_wait__ -Wl,--wrap=mpi_waitall_ -Wl,--wrap=mpi_waitall__ -Wl,--wrap=mpi_waitany_ -Wl,--wrap=mpi_waitany__
ESMF_TRACE_STATICLINKLIBS=-lesmftrace_static


--------------------------------------------------------------
Compiling on Sat Aug 15 20:15:19 MDT 2020 on cgdm-catania
Machine characteristics: Darwin cgdm-catania 18.7.0 Darwin Kernel Version 18.7.0: Tue Aug 20 16:57:14 PDT 2019; root:xnu-4903.271.2~2/RELEASE_X86_64 x86_64
==============================================================
 
Sat Aug 15 20:17:55 MDT 2020 library build ****************FAIL


The following is the 'tail' of the build failure

/project/esmf/GCC/Homebrew/9.3.0_1/mpich/3.3.2/bin/mpicxx: line 299: /project/esmf/GCC/Homebrew/9.3.0_1/g++: No such file or directory
make[8]: *** [/project/esmf/himanshu/esmf_test/cronjobs/daily/gfortran_clang/esmf/obj/objg/Darwin.gfortranclang.64.mpich3.default/exceptions.o] Error 127
/project/esmf/GCC/Homebrew/9.3.0_1/mpich/3.3.2/bin/mpicxx: line 299: /project/esmf/GCC/Homebrew/9.3.0_1/g++: No such file or directory
make[8]: *** [/project/esmf/himanshu/esmf_test/cronjobs/daily/gfortran_clang/esmf/obj/objg/Darwin.gfortranclang.64.mpich3.default/scantag.o] Error 127
/project/esmf/GCC/Homebrew/9.3.0_1/mpich/3.3.2/bin/mpicxx: line 299: /project/esmf/GCC/Homebrew/9.3.0_1/g++: No such file or directory
make[8]: *** [/project/esmf/himanshu/esmf_test/cronjobs/daily/gfortran_clang/esmf/obj/objg/Darwin.gfortranclang.64.mpich3.default/directives.o] Error 127
/project/esmf/GCC/Homebrew/9.3.0_1/mpich/3.3.2/bin/mpicxx: line 299: /project/esmf/GCC/Homebrew/9.3.0_1/g++: No such file or directory
make[8]: *** [/project/esmf/himanshu/esmf_test/cronjobs/daily/gfortran_clang/esmf/obj/objg/Darwin.gfortranclang.64.mpich3.default/exp.o] Error 127
/project/esmf/GCC/Homebrew/9.3.0_1/mpich/3.3.2/bin/mpicxx: line 299: /project/esmf/GCC/Homebrew/9.3.0_1/g++: No such file or directory
make[8]: *** [/project/esmf/himanshu/esmf_test/cronjobs/daily/gfortran_clang/esmf/obj/objg/Darwin.gfortranclang.64.mpich3.default/ostream_wrapper.o] Error 127
/project/esmf/GCC/Homebrew/9.3.0_1/mpich/3.3.2/bin/mpicxx: line 299: /project/esmf/GCC/Homebrew/9.3.0_1/g++: No such file or directory
make[8]: *** [/project/esmf/himanshu/esmf_test/cronjobs/daily/gfortran_clang/esmf/obj/objg/Darwin.gfortranclang.64.mpich3.default/emit.o] Error 127
/project/esmf/GCC/Homebrew/9.3.0_1/mpich/3.3.2/bin/mpicxx: line 299: /project/esmf/GCC/Homebrew/9.3.0_1/g++: No such file or directory
make[8]: *** [/project/esmf/himanshu/esmf_test/cronjobs/daily/gfortran_clang/esmf/obj/objg/Darwin.gfortranclang.64.mpich3.default/parser.o] Error 127
/project/esmf/GCC/Homebrew/9.3.0_1/mpich/3.3.2/bin/mpicxx: line 299: /project/esmf/GCC/Homebrew/9.3.0_1/g++: No such file or directory
make[8]: *** [/project/esmf/himanshu/esmf_test/cronjobs/daily/gfortran_clang/esmf/obj/objg/Darwin.gfortranclang.64.mpich3.default/emitfromevents.o] Error 127
/project/esmf/GCC/Homebrew/9.3.0_1/mpich/3.3.2/bin/mpicxx: line 299: /project/esmf/GCC/Homebrew/9.3.0_1/g++: No such file or directory
/project/esmf/GCC/Homebrew/9.3.0_1/mpich/3.3.2/bin/mpicxx: line 299: /project/esmf/GCC/Homebrew/9.3.0_1/g++: No such file or directory
make[8]: *** [/project/esmf/himanshu/esmf_test/cronjobs/daily/gfortran_clang/esmf/obj/objg/Darwin.gfortranclang.64.mpich3.default/scantoken.o] Error 127
make[8]: *** [/project/esmf/himanshu/esmf_test/cronjobs/daily/gfortran_clang/esmf/obj/objg/Darwin.gfortranclang.64.mpich3.default/nodebuilder.o] Error 127
/project/esmf/GCC/Homebrew/9.3.0_1/mpich/3.3.2/bin/mpicxx: line 299: /project/esmf/GCC/Homebrew/9.3.0_1/g++: No such file or directory
make[8]: *** [/project/esmf/himanshu/esmf_test/cronjobs/daily/gfortran_clang/esmf/obj/objg/Darwin.gfortranclang.64.mpich3.default/stream.o] Error 127
/project/esmf/GCC/Homebrew/9.3.0_1/mpich/3.3.2/bin/mpicxx: line 299: /project/esmf/GCC/Homebrew/9.3.0_1/g++: No such file or directory
make[8]: *** [/project/esmf/himanshu/esmf_test/cronjobs/daily/gfortran_clang/esmf/obj/objg/Darwin.gfortranclang.64.mpich3.default/parse.o] Error 127
/project/esmf/GCC/Homebrew/9.3.0_1/mpich/3.3.2/bin/mpicxx: line 299: /project/esmf/GCC/Homebrew/9.3.0_1/g++: No such file or directory
make[8]: *** [/project/esmf/himanshu/esmf_test/cronjobs/daily/gfortran_clang/esmf/obj/objg/Darwin.gfortranclang.64.mpich3.default/memory.o] Error 127
/project/esmf/GCC/Homebrew/9.3.0_1/mpich/3.3.2/bin/mpicxx: line 299: /project/esmf/GCC/Homebrew/9.3.0_1/g++: No such file or directory
make[8]: *** [/project/esmf/himanshu/esmf_test/cronjobs/daily/gfortran_clang/esmf/obj/objg/Darwin.gfortranclang.64.mpich3.default/simplekey.o] Error 127
/project/esmf/GCC/Homebrew/9.3.0_1/mpich/3.3.2/bin/mpicxx: line 299: /project/esmf/GCC/Homebrew/9.3.0_1/g++: No such file or directory
make[8]: *** [/project/esmf/himanshu/esmf_test/cronjobs/daily/gfortran_clang/esmf/obj/objg/Darwin.gfortranclang.64.mpich3.default/singledocparser.o] Error 127
/project/esmf/GCC/Homebrew/9.3.0_1/mpich/3.3.2/bin/mpicxx: line 299: /project/esmf/GCC/Homebrew/9.3.0_1/g++: No such file or directory
make[8]: *** [/project/esmf/himanshu/esmf_test/cronjobs/daily/gfortran_clang/esmf/obj/objg/Darwin.gfortranclang.64.mpich3.default/emitter.o] Error 127
/project/esmf/GCC/Homebrew/9.3.0_1/mpich/3.3.2/bin/mpicxx: line 299: /project/esmf/GCC/Homebrew/9.3.0_1/g++: No such file or directory
make[8]: *** [/project/esmf/himanshu/esmf_test/cronjobs/daily/gfortran_clang/esmf/obj/objg/Darwin.gfortranclang.64.mpich3.default/regex_yaml.o] Error 127
/project/esmf/GCC/Homebrew/9.3.0_1/mpich/3.3.2/bin/mpicxx: line 299: /project/esmf/GCC/Homebrew/9.3.0_1/g++: No such file or directory
make[8]: *** [/project/esmf/himanshu/esmf_test/cronjobs/daily/gfortran_clang/esmf/obj/objg/Darwin.gfortranclang.64.mpich3.default/node.o] Error 127
/project/esmf/GCC/Homebrew/9.3.0_1/mpich/3.3.2/bin/mpicxx: line 299: /project/esmf/GCC/Homebrew/9.3.0_1/g++: No such file or directory
make[8]: *** [/project/esmf/himanshu/esmf_test/cronjobs/daily/gfortran_clang/esmf/obj/objg/Darwin.gfortranclang.64.mpich3.default/emitterstate.o] Error 127
/project/esmf/GCC/Homebrew/9.3.0_1/mpich/3.3.2/bin/mpicxx: line 299: /project/esmf/GCC/Homebrew/9.3.0_1/g++: No such file or directory
make[8]: *** [/project/esmf/himanshu/esmf_test/cronjobs/daily/gfortran_clang/esmf/obj/objg/Darwin.gfortranclang.64.mpich3.default/scanner.o] Error 127
/project/esmf/GCC/Homebrew/9.3.0_1/mpich/3.3.2/bin/mpicxx: line 299: /project/esmf/GCC/Homebrew/9.3.0_1/g++: No such file or directory
make[8]: *** [/project/esmf/himanshu/esmf_test/cronjobs/daily/gfortran_clang/esmf/obj/objg/Darwin.gfortranclang.64.mpich3.default/node_data.o] Error 127
make[7]: *** [esmflib] Error 2
make[6]: *** [tree_lib] Error 2
make[5]: *** [tree] Error 1
make[4]: *** [tree] Error 1
make[3]: *** [tree] Error 1
make[2]: *** [tree] Error 1
make[1]: *** [build_libs] Error 2
make: *** [lib] Error 2


_______________________________________________________________________________________________

Sat Aug 15 20:19:36 MDT 2020 on cgdm-catania 

ESMF Checkout Source: https://github.com/esmf-org/esmf.git

Compiler and configuration information:

-------------------------------------------------------------- 
Currently Loaded Modulefiles:
 1) GCC/Homebrew/9.3.0_1/gcc   2) GCC/Homebrew/9.3.0_1/mpich/3.3.2   3) GCC/Homebrew/9.3.0_1/netcdf/4.7.4s  

Repository:
origin	https://github.com/esmf-org/esmf.git (fetch)
origin	https://github.com/esmf-org/esmf.git (push)
 
ESMF_8_1_0_beta_snapshot_25-23-g5724188759
 
 
/project/esmf/GCC/Homebrew/9.3.0_1/mpich/3.3.2/bin/mpif90: line 376: /project/esmf/GCC/Homebrew/9.3.0_1/gfortran: No such file or directory
 
--------------------------------------------------------------
ESMF_VERSION_STRING:    8.1.0 beta snapshot
ESMF_8_1_0_beta_snapshot_25-23-g5724188759
--------------------------------------------------------------
On branch develop
Your branch is up to date with 'origin/develop'.

Untracked files:
  (use "git add ..." to include in what will be committed)

	src/installcheck/esmc_application
	src/installcheck/esmc_application.o
	src/installcheck/esmf_application
	src/installcheck/esmf_application.o
	tmp

nothing added to commit but untracked files present (use "git add" to track)
--------------------------------------------------------------
 
--------------------------------------------------------------
Make version:
GNU Make 3.81
Copyright (C) 2006  Free Software Foundation, Inc.
This is free software; see the source for copying conditions.
There is NO warranty; not even for MERCHANTABILITY or FITNESS FOR A
PARTICULAR PURPOSE.

This program built for i386-apple-darwin11.3.0

--------------------------------------------------------------
Fortran Compiler version:
mpifort for MPICH version 3.3.2
/project/esmf/GCC/Homebrew/9.3.0_1/mpich/3.3.2/bin/mpif90: line 376: /project/esmf/GCC/Homebrew/9.3.0_1/gfortran: No such file or directory

--------------------------------------------------------------
C++ Compiler version:
mpicxx for MPICH version 3.3.2
/project/esmf/GCC/Homebrew/9.3.0_1/mpich/3.3.2/bin/mpicxx: line 283: /project/esmf/GCC/Homebrew/9.3.0_1/g++: No such file or directory

--------------------------------------------------------------
Preprocessor version:
Apple LLVM version 10.0.1 (clang-1001.0.46.4)
Target: x86_64-apple-darwin18.7.0
Thread model: posix
InstalledDir: /Library/Developer/CommandLineTools/usr/bin
--------------------------------------------------------------
NetCDF library version: netCDF 4.7.4
NetCDF Fortran version: netCDF-Fortran 4.5.3
 
--------------------------------------------------------------
 * User set ESMF environment variables *
ESMF_ABI=64
ESMF_BOPT=O
ESMF_COMM=mpich3
ESMF_COMPILER=gfortranclang
ESMF_DIR=/project/esmf/himanshu/esmf_test/cronjobs/daily/gfortran_clang/esmf
ESMF_INSTALL_PREFIX=/project/esmf/himanshu/esmf_test/cronjobs/daily/gfortran_clang/install_dir
ESMF_NETCDF=nc-config
ESMF_OS=Darwin
ESMF_SITE=default
ESMF_TESTEXHAUSTIVE=ON
ESMF_TESTMPMD=OFF
ESMF_TESTWITHTHREADS=ON
 
--------------------------------------------------------------
 * ESMF environment variables *
ESMF_DIR: /project/esmf/himanshu/esmf_test/cronjobs/daily/gfortran_clang/esmf
ESMF_OS:                Darwin
ESMF_MACHINE:           x86_64
ESMF_ABI:               64
ESMF_COMPILER:          gfortranclang
ESMF_BOPT:              O
ESMF_COMM:              mpich3
ESMF_SITE:              default
ESMF_PTHREADS:          OFF
ESMF_OPENMP:            OFF
ESMF_OPENACC:           OFF
ESMF_CXXSTD:            11
ESMF_ARRAY_LITE:        FALSE
ESMF_NO_INTEGER_1_BYTE: TRUE
ESMF_NO_INTEGER_2_BYTE: TRUE
ESMF_FORTRANSYMBOLS:    default
ESMF_MAPPER_BUILD:      OFF
ESMF_AUTO_LIB_BUILD:    ON
ESMF_DEFER_LIB_BUILD:   ON
ESMF_SHARED_LIB_BUILD:  ON
ESMF_TRACE_LIB_BUILD:   ON
ESMF_TESTEXHAUSTIVE:    ON
ESMF_TESTCOMPTUNNEL:    ON
ESMF_TESTWITHTHREADS:   ON
ESMF_TESTMPMD:          OFF
ESMF_TESTSHAREDOBJ:     OFF
ESMF_TESTFORCEOPENMP:   OFF
ESMF_TESTFORCEOPENACC:  OFF
ESMF_TESTHARNESS_ARRAY: default
ESMF_TESTHARNESS_FIELD: default
ESMF_MPIRUN:            mpirun 
 
--------------------------------------------------------------
 * ESMF environment variables pointing to 3rd party software *
ESMF_MOAB:               internal
ESMF_LAPACK:             internal
ESMF_ACC_SOFTWARE_STACK: none
ESMF_NETCDF:             nc-config
ESMF_NETCDF_INCLUDE:     /project/esmf/GCC/Homebrew/9.3.0_1/netcdf/4.7.4/include
ESMF_NETCDF_LIBS:        -lnetcdf
ESMF_NETCDF_LIBPATH:     /project/esmf/GCC/Homebrew/9.3.0_1/netcdf/4.7.4/lib
ESMF_NFCONFIG:           nf-config
ESMF_NETCDFF_INCLUDE:    /project/esmf/GCC/Homebrew/9.3.0_1/netcdf/4.7.4/include
ESMF_NETCDFF_LIBS:       -lnetcdff
ESMF_NETCDFF_LIBPATH:    /project/esmf/GCC/Homebrew/9.3.0_1/netcdf/4.7.4/lib
ESMF_YAMLCPP:            internal
ESMF_PIO:                internal
 
--------------------------------------------------------------
 * ESMF environment variables for final installation *
ESMF_INSTALL_PREFIX:    /project/esmf/himanshu/esmf_test/cronjobs/daily/gfortran_clang/install_dir
ESMF_INSTALL_HEADERDIR: include
ESMF_INSTALL_MODDIR:    mod/modO/Darwin.gfortranclang.64.mpich3.default
ESMF_INSTALL_LIBDIR:    lib/libO/Darwin.gfortranclang.64.mpich3.default
ESMF_INSTALL_BINDIR:    bin/binO/Darwin.gfortranclang.64.mpich3.default
ESMF_INSTALL_DOCDIR:    doc
 
--------------------------------------------------------------
 * ESMF Benchmark directory and parameters *
ESMF_BENCHMARK_PREFIX:         ./DEFAULTBENCHMARKDIR
ESMF_BENCHMARK_TOLERANCE:      20%
ESMF_BENCHMARK_THRESHOLD_MSEC: 500
 
--------------------------------------------------------------
 * Other relevant environment variables *
PATH:    /project/esmf/GCC/Homebrew/9.3.0_1/netcdf/4.7.4/bin:/project/esmf/GCC/Homebrew/9.3.0_1/mpich/3.3.2/bin:/project/esmf/GCC/Homebrew/9.3.0_1:/project/esmf/Modules/bin:/home/himanshu/bin:/usr/local/bin:/usr/bin:/bin:/usr/sbin:/sbin:/opt/local/bin:/opt/local/sbin:/opt/X11/bin
LD_LIBRARY_PATH: 
 
dyld: Library not loaded: /usr/local/opt/gcc/lib/gcc/9/libgfortran.5.dylib
  Referenced from: /project/esmf/GCC/Homebrew/9.3.0_1/mpich/3.3.2/lib/libmpi.12.dylib
  Reason: image not found
/project/esmf/himanshu/esmf_test/cronjobs/daily/gfortran_clang/esmf/scripts/libs.mpich3f90: line 5: [: =: unary operator expected
/project/esmf/himanshu/esmf_test/cronjobs/daily/gfortran_clang/esmf/scripts/libs.mpich3f90: line 5: [: =: unary operator expected
dyld: Library not loaded: /usr/local/opt/gcc/lib/gcc/9/libgfortran.5.dylib
  Referenced from: /project/esmf/GCC/Homebrew/9.3.0_1/mpich/3.3.2/lib/libmpi.12.dylib
  Reason: image not found
/project/esmf/himanshu/esmf_test/cronjobs/daily/gfortran_clang/esmf/scripts/libs.mpich3f90: line 5: [: =: unary operator expected
/project/esmf/himanshu/esmf_test/cronjobs/daily/gfortran_clang/esmf/scripts/libs.mpich3f90: line 5: [: =: unary operator expected
dyld: Library not loaded: /usr/local/opt/gcc/lib/gcc/9/libgfortran.5.dylib
  Referenced from: /project/esmf/GCC/Homebrew/9.3.0_1/mpich/3.3.2/lib/libmpi.12.dylib
  Reason: image not found
/project/esmf/himanshu/esmf_test/cronjobs/daily/gfortran_clang/esmf/scripts/libs.mpich3f90: line 5: [: =: unary operator expected
/project/esmf/himanshu/esmf_test/cronjobs/daily/gfortran_clang/esmf/scripts/libs.mpich3f90: line 5: [: =: unary operator expected
--------------------------------------------------------------
 * Compilers, Linkers, Flags, and Libraries *
Location of the preprocessor:      /usr/bin/clang
Location of the Fortran compiler:  /project/esmf/GCC/Homebrew/9.3.0_1/mpich/3.3.2/bin/mpif90
Location of the Fortran linker:    /project/esmf/GCC/Homebrew/9.3.0_1/mpich/3.3.2/bin/mpif90
Location of the C++ compiler:      /project/esmf/GCC/Homebrew/9.3.0_1/mpich/3.3.2/bin/mpicxx
Location of the C++ linker:        /project/esmf/GCC/Homebrew/9.3.0_1/mpich/3.3.2/bin/mpicxx

Fortran compiler flags:
ESMF_F90COMPILER: mpif90
ESMF_F90COMPILEOPTS: -O   -m64 -mcmodel=small -ffree-line-length-none
ESMF_F90COMPILEPATHS: -I/project/esmf/himanshu/esmf_test/cronjobs/daily/gfortran_clang/esmf/mod/modO/Darwin.gfortranclang.64.mpich3.default -I/project/esmf/himanshu/esmf_test/cronjobs/daily/gfortran_clang/esmf/src/include -I/project/esmf/GCC/Homebrew/9.3.0_1/netcdf/4.7.4/include -I/project/esmf/GCC/Homebrew/9.3.0_1/netcdf/4.7.4/include
ESMF_F90COMPILECPPFLAGS: -DESMF_NO_INTEGER_1_BYTE -DESMF_NO_INTEGER_2_BYTE -DESMFVERSIONGIT='ESMF_8_1_0_beta_snapshot_25-23-g5724188759' -DESMF_MOAB=1 -DESMF_LAPACK=1 -DESMF_LAPACK_INTERNAL=1 -DESMF_NO_ACC_SOFTWARE_STACK=1 -DESMF_NETCDF=1 -DESMF_YAMLCPP=1 -DESMF_YAML=1 -DESMF_PIO=1 -DESMF_MPIIO -DESMF_NO_PTHREADS -DESMF_NO_OPENMP -DESMF_NO_OPENACC -DESMF_TESTEXHAUSTIVE -DESMF_BOPT_O -DESMF_TESTCOMPTUNNEL -DESMF_TESTWITHTHREADS -DSx86_64_small=1 -DESMF_OS_Darwin=1 -DESMF_COMM=mpich3 -DESMF_DIR=/project/esmf/himanshu/esmf_test/cronjobs/daily/gfortran_clang/esmf
ESMF_F90COMPILEFREECPP: 
ESMF_F90COMPILEFREENOCPP: -ffree-form
ESMF_F90COMPILEFIXCPP: -cpp -ffixed-form
ESMF_F90COMPILEFIXNOCPP: 

Fortran linker flags:
ESMF_F90LINKOPTS:    -m64 -mcmodel=small
ESMF_F90LINKPATHS: -L/project/esmf/himanshu/esmf_test/cronjobs/daily/gfortran_clang/esmf/lib/libO/Darwin.gfortranclang.64.mpich3.default -L/project/esmf/GCC/Homebrew/9.3.0_1/netcdf/4.7.4/lib -L/project/esmf/GCC/Homebrew/9.3.0_1/netcdf/4.7.4/lib
ESMF_F90LINKRPATHS: -Wl,-rpath,/project/esmf/himanshu/esmf_test/cronjobs/daily/gfortran_clang/esmf/lib/libO/Darwin.gfortranclang.64.mpich3.default -Wl,-rpath,/project/esmf/GCC/Homebrew/9.3.0_1/netcdf/4.7.4/lib -Wl,-rpath,/project/esmf/GCC/Homebrew/9.3.0_1/netcdf/4.7.4/lib
ESMF_F90LINKLIBS:  -lstdc++ -lc++ -lnetcdf -lnetcdff
ESMF_F90ESMFLINKLIBS: -lesmf  -lstdc++ -lc++ -lnetcdf -lnetcdff

C++ compiler flags:
ESMF_CXXCOMPILER: mpicxx
ESMF_CXXCOMPILEOPTS: -std=c++11 -O -DNDEBUG  -DESMF_LOWERCASE_SINGLEUNDERSCORE -m64 -mcmodel=small
ESMF_CXXCOMPILEPATHS:  -I/project/esmf/himanshu/esmf_test/cronjobs/daily/gfortran_clang/esmf/src/include  -I/project/esmf/GCC/Homebrew/9.3.0_1/netcdf/4.7.4/include -I/project/esmf/himanshu/esmf_test/cronjobs/daily/gfortran_clang/esmf/src/prologue/yaml-cpp/include
ESMF_CXXCOMPILECPPFLAGS: -DESMF_NO_INTEGER_1_BYTE -DESMF_NO_INTEGER_2_BYTE -DESMFVERSIONGIT='ESMF_8_1_0_beta_snapshot_25-23-g5724188759' -DESMF_MOAB=1 -DESMF_LAPACK=1 -DESMF_LAPACK_INTERNAL=1 -DESMF_NO_ACC_SOFTWARE_STACK=1 -DESMF_NETCDF=1 -DESMF_YAMLCPP=1 -DESMF_YAML=1 -DESMF_PIO=1 -DESMF_MPIIO -DESMF_NO_PTHREADS -DESMF_NO_OPENMP -DESMF_NO_OPENACC -DESMF_TESTEXHAUSTIVE -DESMF_BOPT_O -DESMF_TESTCOMPTUNNEL -DESMF_TESTWITHTHREADS -DSx86_64_small=1 -DESMF_OS_Darwin=1 -DESMF_COMM=mpich3 -DESMF_DIR=/project/esmf/himanshu/esmf_test/cronjobs/daily/gfortran_clang/esmf -D__SDIR__='' -DESMF_CXXSTD=11 -x c++

C++ linker flags:
ESMF_CXXLINKOPTS:   -m64 -mcmodel=small
ESMF_CXXLINKPATHS: -L/project/esmf/himanshu/esmf_test/cronjobs/daily/gfortran_clang/esmf/lib/libO/Darwin.gfortranclang.64.mpich3.default -L/project/esmf/GCC/Homebrew/9.3.0_1/netcdf/4.7.4/lib -L/project/esmf/GCC/Homebrew/9.3.0_1/netcdf/4.7.4/lib -L
ESMF_CXXLINKRPATHS: -Wl,-rpath,/project/esmf/himanshu/esmf_test/cronjobs/daily/gfortran_clang/esmf/lib/libO/Darwin.gfortranclang.64.mpich3.default -Wl,-rpath,/project/esmf/GCC/Homebrew/9.3.0_1/netcdf/4.7.4/lib -Wl,-rpath,/project/esmf/GCC/Homebrew/9.3.0_1/netcdf/4.7.4/lib -Wl,-rpath,
ESMF_CXXLINKLIBS:  -lmpifort -lgfortran -lstdc++ -lc++ -lnetcdf -lnetcdff
ESMF_CXXESMFLINKLIBS: -lesmf  -lmpifort -lgfortran -lstdc++ -lc++ -lnetcdf -lnetcdff

Shared library build:
ESMF_SL_LIBS_TO_MAKE: libesmf
ESMF_SL_SUFFIX:       dylib
ESMF_SL_LIBLINKER:    mpicxx
ESMF_SL_LIBOPTS:       -dynamiclib
ESMF_SL_LIBLIBS:       -L/project/esmf/himanshu/esmf_test/cronjobs/daily/gfortran_clang/esmf/lib/libO/Darwin.gfortranclang.64.mpich3.default -L/project/esmf/GCC/Homebrew/9.3.0_1/netcdf/4.7.4/lib -L/project/esmf/GCC/Homebrew/9.3.0_1/netcdf/4.7.4/lib  -lstdc++ -lc++ -lnetcdf -lnetcdff -L/project/esmf/himanshu/esmf_test/cronjobs/daily/gfortran_clang/esmf/lib/libO/Darwin.gfortranclang.64.mpich3.default -L/project/esmf/GCC/Homebrew/9.3.0_1/netcdf/4.7.4/lib -L/project/esmf/GCC/Homebrew/9.3.0_1/netcdf/4.7.4/lib -L  -lmpifort -lgfortran -lstdc++ -lc++ -lnetcdf -lnetcdff

ESMF Tracing linker options:
ESMF_TRACE_LDPRELOAD=/project/esmf/himanshu/esmf_test/cronjobs/daily/gfortran_clang/esmf/lib/libO/Darwin.gfortranclang.64.mpich3.default/libesmftrace_preload.dylib
ESMF_TRACE_STATICLINKOPTS=-static -Wl,--wrap=c_esmftrace_notify_wrappers -Wl,--wrap=c_esmftrace_isinitialized -Wl,--wrap=write -Wl,--wrap=writev -Wl,--wrap=pwrite -Wl,--wrap=read -Wl,--wrap=open -Wl,--wrap=MPI_Allgather -Wl,--wrap=MPI_Allgatherv -Wl,--wrap=MPI_Allreduce -Wl,--wrap=MPI_Alltoall -Wl,--wrap=MPI_Alltoallv -Wl,--wrap=MPI_Alltoallw -Wl,--wrap=MPI_Barrier -Wl,--wrap=MPI_Bcast -Wl,--wrap=MPI_Gather -Wl,--wrap=MPI_Gatherv -Wl,--wrap=MPI_Recv -Wl,--wrap=MPI_Reduce -Wl,--wrap=MPI_Scatter -Wl,--wrap=MPI_Send -Wl,--wrap=MPI_Sendrecv -Wl,--wrap=MPI_Wait -Wl,--wrap=MPI_Waitall -Wl,--wrap=MPI_Waitany -Wl,--wrap=MPI_Waitsome -Wl,--wrap=mpi_allgather_ -Wl,--wrap=mpi_allgather__ -Wl,--wrap=mpi_allgatherv_ -Wl,--wrap=mpi_allgatherv__ -Wl,--wrap=mpi_allreduce_ -Wl,--wrap=mpi_allreduce__ -Wl,--wrap=mpi_alltoall_ -Wl,--wrap=mpi_alltoall__ -Wl,--wrap=mpi_alltoallv_ -Wl,--wrap=mpi_alltoallv__ -Wl,--wrap=mpi_alltoallw_ -Wl,--wrap=mpi_alltoallw__ -Wl,--wrap=mpi_barrier_ -Wl,--wrap=mpi_barrier__ -Wl,--wrap=mpi_bcast_ -Wl,--wrap=mpi_bcast__ -Wl,--wrap=mpi_exscan_ -Wl,--wrap=mpi_exscan__ -Wl,--wrap=mpi_gather_ -Wl,--wrap=mpi_gather__ -Wl,--wrap=mpi_gatherv_ -Wl,--wrap=mpi_gatherv__ -Wl,--wrap=mpi_recv_ -Wl,--wrap=mpi_recv__ -Wl,--wrap=mpi_reduce_ -Wl,--wrap=mpi_reduce__ -Wl,--wrap=mpi_reduce_scatter_ -Wl,--wrap=mpi_reduce_scatter__ -Wl,--wrap=mpi_scatter_ -Wl,--wrap=mpi_scatter__ -Wl,--wrap=mpi_scatterv_ -Wl,--wrap=mpi_scatterv__ -Wl,--wrap=mpi_scan_ -Wl,--wrap=mpi_scan__ -Wl,--wrap=mpi_send_ -Wl,--wrap=mpi_send__ -Wl,--wrap=mpi_wait_ -Wl,--wrap=mpi_wait__ -Wl,--wrap=mpi_waitall_ -Wl,--wrap=mpi_waitall__ -Wl,--wrap=mpi_waitany_ -Wl,--wrap=mpi_waitany__
ESMF_TRACE_STATICLINKLIBS=-lesmftrace_static


--------------------------------------------------------------
Compiling on Sat Aug 15 20:19:37 MDT 2020 on cgdm-catania
Machine characteristics: Darwin cgdm-catania 18.7.0 Darwin Kernel Version 18.7.0: Tue Aug 20 16:57:14 PDT 2019; root:xnu-4903.271.2~2/RELEASE_X86_64 x86_64
==============================================================
 
Sat Aug 15 20:21:35 MDT 2020 library build ****************FAIL


The following is the 'tail' of the build failure

/project/esmf/GCC/Homebrew/9.3.0_1/mpich/3.3.2/bin/mpicxx: line 299: /project/esmf/GCC/Homebrew/9.3.0_1/g++: No such file or directory
/project/esmf/GCC/Homebrew/9.3.0_1/mpich/3.3.2/bin/mpicxx: line 299: /project/esmf/GCC/Homebrew/9.3.0_1/g++: No such file or directory
make[8]: *** [/project/esmf/himanshu/esmf_test/cronjobs/daily/gfortran_clang/esmf/obj/objO/Darwin.gfortranclang.64.mpich3.default/null.o] Error 127
make[8]: *** [/project/esmf/himanshu/esmf_test/cronjobs/daily/gfortran_clang/esmf/obj/objO/Darwin.gfortranclang.64.mpich3.default/directives.o] Error 127
/project/esmf/GCC/Homebrew/9.3.0_1/mpich/3.3.2/bin/mpicxx: line 299: /project/esmf/GCC/Homebrew/9.3.0_1/g++: No such file or directory
make[8]: *** [/project/esmf/himanshu/esmf_test/cronjobs/daily/gfortran_clang/esmf/obj/objO/Darwin.gfortranclang.64.mpich3.default/exp.o] Error 127
/project/esmf/GCC/Homebrew/9.3.0_1/mpich/3.3.2/bin/mpicxx: line 299: /project/esmf/GCC/Homebrew/9.3.0_1/g++: No such file or directory
make[8]: *** [/project/esmf/himanshu/esmf_test/cronjobs/daily/gfortran_clang/esmf/obj/objO/Darwin.gfortranclang.64.mpich3.default/ostream_wrapper.o] Error 127
/project/esmf/GCC/Homebrew/9.3.0_1/mpich/3.3.2/bin/mpicxx: line 299: /project/esmf/GCC/Homebrew/9.3.0_1/g++: No such file or directory
make[8]: *** [/project/esmf/himanshu/esmf_test/cronjobs/daily/gfortran_clang/esmf/obj/objO/Darwin.gfortranclang.64.mpich3.default/scantoken.o] Error 127
/project/esmf/GCC/Homebrew/9.3.0_1/mpich/3.3.2/bin/mpicxx: line 299: /project/esmf/GCC/Homebrew/9.3.0_1/g++: No such file or directory
make[8]: *** [/project/esmf/himanshu/esmf_test/cronjobs/daily/gfortran_clang/esmf/obj/objO/Darwin.gfortranclang.64.mpich3.default/emit.o] Error 127
/project/esmf/GCC/Homebrew/9.3.0_1/mpich/3.3.2/bin/mpicxx: line 299: /project/esmf/GCC/Homebrew/9.3.0_1/g++: No such file or directory
make[8]: *** [/project/esmf/himanshu/esmf_test/cronjobs/daily/gfortran_clang/esmf/obj/objO/Darwin.gfortranclang.64.mpich3.default/memory.o] Error 127
/project/esmf/GCC/Homebrew/9.3.0_1/mpich/3.3.2/bin/mpicxx: line 299: /project/esmf/GCC/Homebrew/9.3.0_1/g++: No such file or directory
make[8]: *** [/project/esmf/himanshu/esmf_test/cronjobs/daily/gfortran_clang/esmf/obj/objO/Darwin.gfortranclang.64.mpich3.default/parse.o] Error 127
/project/esmf/GCC/Homebrew/9.3.0_1/mpich/3.3.2/bin/mpicxx: line 299: /project/esmf/GCC/Homebrew/9.3.0_1/g++: No such file or directory
/project/esmf/GCC/Homebrew/9.3.0_1/mpich/3.3.2/bin/mpicxx: line 299: /project/esmf/GCC/Homebrew/9.3.0_1/g++: No such file or directory
/project/esmf/GCC/Homebrew/9.3.0_1/mpich/3.3.2/bin/mpicxx: line 299: /project/esmf/GCC/Homebrew/9.3.0_1/g++: No such file or directory
make[8]: *** [/project/esmf/himanshu/esmf_test/cronjobs/daily/gfortran_clang/esmf/obj/objO/Darwin.gfortranclang.64.mpich3.default/nodebuilder.o] Error 127
make[8]: *** [/project/esmf/himanshu/esmf_test/cronjobs/daily/gfortran_clang/esmf/obj/objO/Darwin.gfortranclang.64.mpich3.default/simplekey.o] Error 127
make[8]: *** [/project/esmf/himanshu/esmf_test/cronjobs/daily/gfortran_clang/esmf/obj/objO/Darwin.gfortranclang.64.mpich3.default/emitfromevents.o] Error 127
/project/esmf/GCC/Homebrew/9.3.0_1/mpich/3.3.2/bin/mpicxx: line 299: /project/esmf/GCC/Homebrew/9.3.0_1/g++: No such file or directory
make[8]: *** [/project/esmf/himanshu/esmf_test/cronjobs/daily/gfortran_clang/esmf/obj/objO/Darwin.gfortranclang.64.mpich3.default/emitter.o] Error 127
/project/esmf/GCC/Homebrew/9.3.0_1/mpich/3.3.2/bin/mpicxx: line 299: /project/esmf/GCC/Homebrew/9.3.0_1/g++: No such file or directory
make[8]: *** [/project/esmf/himanshu/esmf_test/cronjobs/daily/gfortran_clang/esmf/obj/objO/Darwin.gfortranclang.64.mpich3.default/node_data.o] Error 127
/project/esmf/GCC/Homebrew/9.3.0_1/mpich/3.3.2/bin/mpicxx: line 299: /project/esmf/GCC/Homebrew/9.3.0_1/g++: No such file or directory
make[8]: *** [/project/esmf/himanshu/esmf_test/cronjobs/daily/gfortran_clang/esmf/obj/objO/Darwin.gfortranclang.64.mpich3.default/parser.o] Error 127
/project/esmf/GCC/Homebrew/9.3.0_1/mpich/3.3.2/bin/mpicxx: line 299: /project/esmf/GCC/Homebrew/9.3.0_1/g++: No such file or directory
make[8]: *** [/project/esmf/himanshu/esmf_test/cronjobs/daily/gfortran_clang/esmf/obj/objO/Darwin.gfortranclang.64.mpich3.default/singledocparser.o] Error 127
/project/esmf/GCC/Homebrew/9.3.0_1/mpich/3.3.2/bin/mpicxx: line 299: /project/esmf/GCC/Homebrew/9.3.0_1/g++: No such file or directory
/project/esmf/GCC/Homebrew/9.3.0_1/mpich/3.3.2/bin/mpicxx: line 299: /project/esmf/GCC/Homebrew/9.3.0_1/g++: No such file or directory
make[8]: *** [/project/esmf/himanshu/esmf_test/cronjobs/daily/gfortran_clang/esmf/obj/objO/Darwin.gfortranclang.64.mpich3.default/scanner.o] Error 127
make[8]: *** [/project/esmf/himanshu/esmf_test/cronjobs/daily/gfortran_clang/esmf/obj/objO/Darwin.gfortranclang.64.mpich3.default/stream.o] Error 127
/project/esmf/GCC/Homebrew/9.3.0_1/mpich/3.3.2/bin/mpicxx: line 299: /project/esmf/GCC/Homebrew/9.3.0_1/g++: No such file or directory
make[8]: *** [/project/esmf/himanshu/esmf_test/cronjobs/daily/gfortran_clang/esmf/obj/objO/Darwin.gfortranclang.64.mpich3.default/emitterstate.o] Error 127
/project/esmf/GCC/Homebrew/9.3.0_1/mpich/3.3.2/bin/mpicxx: line 299: /project/esmf/GCC/Homebrew/9.3.0_1/g++: No such file or directory
make[8]: *** [/project/esmf/himanshu/esmf_test/cronjobs/daily/gfortran_clang/esmf/obj/objO/Darwin.gfortranclang.64.mpich3.default/tag.o] Error 127
/project/esmf/GCC/Homebrew/9.3.0_1/mpich/3.3.2/bin/mpicxx: line 299: /project/esmf/GCC/Homebrew/9.3.0_1/g++: No such file or directory
make[8]: *** [/project/esmf/himanshu/esmf_test/cronjobs/daily/gfortran_clang/esmf/obj/objO/Darwin.gfortranclang.64.mpich3.default/node.o] Error 127
/project/esmf/GCC/Homebrew/9.3.0_1/mpich/3.3.2/bin/mpicxx: line 299: /project/esmf/GCC/Homebrew/9.3.0_1/g++: No such file or directory
make[8]: *** [/project/esmf/himanshu/esmf_test/cronjobs/daily/gfortran_clang/esmf/obj/objO/Darwin.gfortranclang.64.mpich3.default/regex_yaml.o] Error 127
make[7]: *** [esmflib] Error 2
make[6]: *** [tree_lib] Error 2
make[5]: *** [tree] Error 1
make[4]: *** [tree] Error 1
make[3]: *** [tree] Error 1
make[2]: *** [tree] Error 1
make[1]: *** [build_libs] Error 2
make: *** [lib] Error 2